{"text_format":"1","workbook":"xlsx","n_sheets":7,"sheets":["INFO","saisie","M Q","Clb Q (2)","Clb Q","P.F.","PALMARES"],"not_rendered":{"charts":0,"images":3,"macros":0,"external_links":0,"defined_names":7,"comments":0,"pivot_tables":0},"unopened":[],"bounds":{"document_bytes":16777216,"sheet_cells":100000,"rows_first":2000,"rows_last":500,"rows_between":2000,"halvings":0,"cell_chars":16384,"cell_head_chars":4096},"cells_cut":0,"cells_raw":0,"read":"whole","date_system":"1904"}

{"sheet":"INFO","index":0,"n_rows":19,"n_cols":3,"rows_kept":19,"cut":false,"hidden":false,"merged":[[0,0,0,2],[1,0,1,2],[15,0,15,2],[18,0,18,1],[2,0,2,2],[10,0,10,2],[16,0,16,1],[17,0,17,1]]}
["PROGRAMME DE GESTION \nCHAMPIONNAT DE FRANCE DES CLUBS\n10 METRES"]
[]
["COMPETITION"]
["date :","15 et 16 janvier 2021"]
["lieu :","PONS"]
["saison :","2021-2022"]
["Discipline :","PISTOLET","(CARABINE ou PISTOLET)"]
["Nombre d'équipe :",4]
["LIGUE :","POITOU-CHARENTES","(EN MAJUSCULE)"]
[]
{"$rows_left_out":10}
{"sheet":"saisie","index":1,"n_rows":26,"n_cols":38,"rows_kept":26,"cut":false,"hidden":false,"merged":[[4,23,4,25],[4,26,5,26],[4,9,5,9],[4,15,5,15],[4,33,5,33],[4,29,4,31],[4,32,5,32],[4,20,5,20],[0,0,1,28],[2,0,3,35],[4,37,5,37],[4,35,5,35],[4,21,5,21],[4,27,5,27],[4,0,5,0],[4,2,5,2],[4,3,5,3],[4,5,4,7],[4,8,5,8],[4,11,4,13],[4,14,5,14],[4,17,4,19],[4,1,5,1],[4,34,5,34]]}
[]
[]
[{"$f":"CONCATENATE(\"MATCH DE QUALIFICATION\",\" - \",INFO!B7,\" - \",INFO!B9)","v":"MATCH DE QUALIFICATION - PISTOLET - POITOU-CHARENTES"}]
[]
["POSTE","Cl.","CLUB","N° club","Nom","Séries",null,null,"Total","M*","Nom","Séries",null,null,"Total","M*","Nom","Séries",null,null,"Total","M*","Nom","Séries",null,null,"Total","M*","Nom","Séries",null,null,"Total","M*","TT","Bar.",null,"TOTAL"]
[null,null,null,null,"1er Tireur",1,2,3,null,null,"2ème Tireur",1,2,3,null,null,"3ème Tireur",1,2,3,null,null,"4ème Tireur",1,2,3,null,null,"5ème Tireur",1,2,3]
[1,{"$f":"RANK(AL7,$AL$7:$AL$26,0)","v":3},"JONZAC   S.J.T",1717165,"GIOVANNONE Philippe",84,80,83,{"$f":"SUM(F7:H7)","v":247},null,"SOURIS Christine",81,75,81,{"$f":"SUM(L7:N7)","v":237},null,"ACHTOUK Kenza",92,92,88,{"$f":"SUM(R7:T7)","v":272},null,"ARRIGONI Stéphane",80,81,89,{"$f":"SUM(X7:Z7)","v":250},null,"CORMELIER Hervé",91,88,83,{"$f":"SUM(AD7:AF7)","v":262},null,{"$f":"SUM(I7+O7+U7+AA7+AG7)","v":1268},{"$f":"J7+P7+V7+AB7+AH7","v":0},null,{"$f":"I7+O7+U7+AA7+AG7+(0.000001*(J7+P7+V7+AB7+AH7))+(0.000000001*(H7+N7+T7+Z7+AF7))+(0.000000000001*(G7+M7+S7+Y7+AE7))","v":1268.0000004244162}]
[2,2,"PONS   A.P.T.S",1717100,"DEBAIN Nathalie",80,82,75,{"$f":"SUM(F8:H8)","v":237},null,"ROUSSEAU Valérie",83,82,92,{"$f":"SUM(L8:N8)","v":257},null,"ROUSSEAU Thierry",87,83,85,{"$f":"SUM(R8:T8)","v":255},null,"POULLY Pascal",84,86,89,{"$f":"SUM(X8:Z8)","v":259},null,"BERNARD Kevin",89,90,91,{"$f":"SUM(AD8:AF8)","v":270},null,{"$f":"SUM(I8+O8+U8+AA8+AG8)","v":1278},{"$f":"J8+P8+V8+AB8+AH8","v":0},null,{"$f":"I8+O8+U8+AA8+AG8+(0.000001*(J8+P8+V8+AB8+AH8))+(0.000000001*(H8+N8+T8+Z8+AF8))+(0.000000000001*(G8+M8+S8+Y8+AE8))","v":1278.0000004324229}]
[3,1,"ROCHEFORT   T.S.R",1717160,"BAUDET Philippe",89,90,88,{"$f":"SUM(F9:H9)","v":267},null,"BERGOGNE Cyril",95,91,95,{"$f":"SUM(L9:N9)","v":281},null,"MERCIER Rémy",87,88,86,{"$f":"SUM(R9:T9)","v":261},null,"BRIAND Ptrick",83,74,77,{"$f":"SUM(X9:Z9)","v":234},null,"MERCIER Mickael",88,90,91,{"$f":"SUM(AD9:AF9)","v":269},null,{"$f":"SUM(I9+O9+U9+AA9+AG9)","v":1312},0,null,1312.0000004374328]
[4,4,"SAINTES S.S.T",1717031,"JACQUES Christophe",89,88,88,{"$f":"SUM(F10:H10)","v":265},null,"RABAT Catherine",52,46,33,{"$f":"SUM(L10:N10)","v":131},null,"SOULIER Jean",81,84,83,{"$f":"SUM(R10:T10)","v":248},null,"BOIN Bertrand",71,75,79,{"$f":"SUM(X10:Z10)","v":225},null,"FLEURET Eric",92,90,91,{"$f":"SUM(AD10:AF10)","v":273},null,{"$f":"SUM(I10+O10+U10+AA10+AG10)","v":1142},0,null,1142.0000003743828]
{"$rows_left_out":17}
{"sheet":"M Q","index":2,"n_rows":46,"n_cols":35,"rows_kept":46,"cut":false,"hidden":false,"merged":[[2,0,3,34],[4,35,5,35],[4,0,5,0],[4,7,5,7],[4,34,5,34],[4,1,5,1],[4,13,5,13],[4,19,5,19],[4,25,5,25],[4,33,5,33],[4,2,5,2],[4,31,5,31],[4,8,5,8],[4,14,5,14],[4,20,5,20],[4,26,5,26],[4,32,5,32],[4,4,5,6],[4,10,5,12],[4,16,5,18],[4,22,5,24],[4,28,5,30],[4,3,5,3],[4,9,5,9],[4,15,5,15],[4,21,5,21],[4,27,5,27]]}
[]
[]
[{"$f":"CONCATENATE(\"MATCH DE QUALIFICATION\",\" - \",INFO!B7,\" - \",INFO!B9)","v":"MATCH DE QUALIFICATION - PISTOLET - POITOU-CHARENTES"}]
[]
["Cl.","CLUB","N° club","1er Tireur","séries",null,null,"Total","M*","2ème Tireur","séries",null,null,"Total","M*","3ème Tireur","séries",null,null,"Total","M*","4ème Tireur","séries",null,null,"Total","M*","5ème Tireur","séries",null,null,"Total","M*","TOTAL","M* TT"]
[]
[1,{"$f":"VLOOKUP(A7,saisie!B$7:AL$26,2,0)","v":"ROCHEFORT   T.S.R"},{"$f":"VLOOKUP(A7,saisie!B$7:AL$26,3,0)","v":1717160},{"$f":"VLOOKUP(A7,saisie!B$7:AL$26,4,0)","v":"BAUDET Philippe"},{"$f":"VLOOKUP(A7,saisie!B$7:AL$26,5,0)","v":89},{"$f":"VLOOKUP(A7,saisie!B$7:AL$26,6,0)","v":90},{"$f":"VLOOKUP(A7,saisie!B$7:AL$26,7,0)","v":88},{"$f":"VLOOKUP(A7,saisie!B$7:AL$26,8,0)","v":267},{"$f":"VLOOKUP(A7,saisie!B$7:AL$26,9,0)","v":0},{"$f":"VLOOKUP(A7,saisie!B$7:AL$26,10,0)","v":"BERGOGNE Cyril"},{"$f":"VLOOKUP(A7,saisie!B$7:AL$26,11,0)","v":95},{"$f":"VLOOKUP(A7,saisie!B$7:AL$26,12,0)","v":91},{"$f":"VLOOKUP(A7,saisie!B$7:AL$26,13,0)","v":95},{"$f":"VLOOKUP(A7,saisie!B$7:AL$26,14,0)","v":281},{"$f":"VLOOKUP(A7,saisie!B$7:AL$26,15,0)","v":0},{"$f":"VLOOKUP(A7,saisie!B$7:AL$26,16,0)","v":"MERCIER Rémy"},{"$f":"VLOOKUP(A7,saisie!B$7:AL$26,17,0)","v":87},{"$f":"VLOOKUP(A7,saisie!B$7:AL$26,18,0)","v":88},{"$f":"VLOOKUP(A7,saisie!B$7:AL$26,19,0)","v":86},{"$f":"VLOOKUP(A7,saisie!B$7:AL$26,20,0)","v":261},{"$f":"VLOOKUP(A7,saisie!B$7:AL$26,21,0)","v":0},{"$f":"VLOOKUP(A7,saisie!B$7:AL$26,22,0)","v":"BRIAND Ptrick"},{"$f":"VLOOKUP(A7,saisie!B$7:AL$26,23,0)","v":83},{"$f":"VLOOKUP(A7,saisie!B$7:AL$26,24,0)","v":74},{"$f":"VLOOKUP(A7,saisie!B$7:AL$26,25,0)","v":77},{"$f":"VLOOKUP(A7,saisie!B$7:AL$26,26,0)","v":234},{"$f":"VLOOKUP(A7,saisie!B$7:AL$26,27,0)","v":0},{"$f":"VLOOKUP(A7,saisie!B$7:AL$26,28,0)","v":"MERCIER Mickael"},{"$f":"VLOOKUP(A7,saisie!B$7:AL$26,29,0)","v":88},{"$f":"VLOOKUP(A7,saisie!B$7:AL$26,30,0)","v":90},{"$f":"VLOOKUP(A7,saisie!B$7:AL$26,31,0)","v":91},{"$f":"VLOOKUP(A7,saisie!B$7:AL$26,32,0)","v":269},{"$f":"VLOOKUP(A7,saisie!B$7:AL$26,33,0)","v":0},{"$f":"VLOOKUP(A7,saisie!B$7:AL$26,34,0)","v":1312},{"$f":"VLOOKUP(A7,saisie!B$7:AL$26,35,0)","v":0}]
[{"$f":"IF(INFO!B8>1,2,\"\")","v":2},{"$f":"VLOOKUP(A8,saisie!B$7:AL$26,2,0)","v":"PONS   A.P.T.S"},{"$f":"VLOOKUP(A8,saisie!B$7:AL$26,3,0)","v":1717100},{"$f":"VLOOKUP(A8,saisie!B$7:AL$26,4,0)","v":"DEBAIN Nathalie"},{"$f":"VLOOKUP(A8,saisie!B$7:AL$26,5,0)","v":80},{"$f":"VLOOKUP(A8,saisie!B$7:AL$26,6,0)","v":82},{"$f":"VLOOKUP(A8,saisie!B$7:AL$26,7,0)","v":75},{"$f":"VLOOKUP(A8,saisie!B$7:AL$26,8,0)","v":237},{"$f":"VLOOKUP(A8,saisie!B$7:AL$26,9,0)","v":0},{"$f":"VLOOKUP(A8,saisie!B$7:AL$26,10,0)","v":"ROUSSEAU Valérie"},{"$f":"VLOOKUP(A8,saisie!B$7:AL$26,11,0)","v":83},{"$f":"VLOOKUP(A8,saisie!B$7:AL$26,12,0)","v":82},{"$f":"VLOOKUP(A8,saisie!B$7:AL$26,13,0)","v":92},{"$f":"VLOOKUP(A8,saisie!B$7:AL$26,14,0)","v":257},{"$f":"VLOOKUP(A8,saisie!B$7:AL$26,15,0)","v":0},{"$f":"VLOOKUP(A8,saisie!B$7:AL$26,16,0)","v":"ROUSSEAU Thierry"},{"$f":"VLOOKUP(A8,saisie!B$7:AL$26,17,0)","v":87},{"$f":"VLOOKUP(A8,saisie!B$7:AL$26,18,0)","v":83},{"$f":"VLOOKUP(A8,saisie!B$7:AL$26,19,0)","v":85},{"$f":"VLOOKUP(A8,saisie!B$7:AL$26,20,0)","v":255},{"$f":"VLOOKUP(A8,saisie!B$7:AL$26,21,0)","v":0},{"$f":"VLOOKUP(A8,saisie!B$7:AL$26,22,0)","v":"POULLY Pascal"},{"$f":"VLOOKUP(A8,saisie!B$7:AL$26,23,0)","v":84},{"$f":"VLOOKUP(A8,saisie!B$7:AL$26,24,0)","v":86},{"$f":"VLOOKUP(A8,saisie!B$7:AL$26,25,0)","v":89},{"$f":"VLOOKUP(A8,saisie!B$7:AL$26,26,0)","v":259},{"$f":"VLOOKUP(A8,saisie!B$7:AL$26,27,0)","v":0},{"$f":"VLOOKUP(A8,saisie!B$7:AL$26,28,0)","v":"BERNARD Kevin"},{"$f":"VLOOKUP(A8,saisie!B$7:AL$26,29,0)","v":89},{"$f":"VLOOKUP(A8,saisie!B$7:AL$26,30,0)","v":90},{"$f":"VLOOKUP(A8,saisie!B$7:AL$26,31,0)","v":91},{"$f":"VLOOKUP(A8,saisie!B$7:AL$26,32,0)","v":270},{"$f":"VLOOKUP(A8,saisie!B$7:AL$26,33,0)","v":0},{"$f":"VLOOKUP(A8,saisie!B$7:AL$26,34,0)","v":1278},{"$f":"VLOOKUP(A8,saisie!B$7:AL$26,35,0)","v":0}]
[{"$f":"IF(INFO!B8>2,3,\"\")","v":3},{"$f":"VLOOKUP(A9,saisie!B$7:AL$26,2,0)","v":"JONZAC   S.J.T"},{"$f":"VLOOKUP(A9,saisie!B$7:AL$26,3,0)","v":1717165},{"$f":"VLOOKUP(A9,saisie!B$7:AL$26,4,0)","v":"GIOVANNONE Philippe"},{"$f":"VLOOKUP(A9,saisie!B$7:AL$26,5,0)","v":84},{"$f":"VLOOKUP(A9,saisie!B$7:AL$26,6,0)","v":80},{"$f":"VLOOKUP(A9,saisie!B$7:AL$26,7,0)","v":83},{"$f":"VLOOKUP(A9,saisie!B$7:AL$26,8,0)","v":247},{"$f":"VLOOKUP(A9,saisie!B$7:AL$26,9,0)","v":0},{"$f":"VLOOKUP(A9,saisie!B$7:AL$26,10,0)","v":"SOURIS Christine"},{"$f":"VLOOKUP(A9,saisie!B$7:AL$26,11,0)","v":81},{"$f":"VLOOKUP(A9,saisie!B$7:AL$26,12,0)","v":75},{"$f":"VLOOKUP(A9,saisie!B$7:AL$26,13,0)","v":81},{"$f":"VLOOKUP(A9,saisie!B$7:AL$26,14,0)","v":237},{"$f":"VLOOKUP(A9,saisie!B$7:AL$26,15,0)","v":0},{"$f":"VLOOKUP(A9,saisie!B$7:AL$26,16,0)","v":"ACHTOUK Kenza"},{"$f":"VLOOKUP(A9,saisie!B$7:AL$26,17,0)","v":92},{"$f":"VLOOKUP(A9,saisie!B$7:AL$26,18,0)","v":92},{"$f":"VLOOKUP(A9,saisie!B$7:AL$26,19,0)","v":88},{"$f":"VLOOKUP(A9,saisie!B$7:AL$26,20,0)","v":272},{"$f":"VLOOKUP(A9,saisie!B$7:AL$26,21,0)","v":0},{"$f":"VLOOKUP(A9,saisie!B$7:AL$26,22,0)","v":"ARRIGONI Stéphane"},{"$f":"VLOOKUP(A9,saisie!B$7:AL$26,23,0)","v":80},{"$f":"VLOOKUP(A9,saisie!B$7:AL$26,24,0)","v":81},{"$f":"VLOOKUP(A9,saisie!B$7:AL$26,25,0)","v":89},{"$f":"VLOOKUP(A9,saisie!B$7:AL$26,26,0)","v":250},{"$f":"VLOOKUP(A9,saisie!B$7:AL$26,27,0)","v":0},{"$f":"VLOOKUP(A9,saisie!B$7:AL$26,28,0)","v":"CORMELIER Hervé"},{"$f":"VLOOKUP(A9,saisie!B$7:AL$26,29,0)","v":91},{"$f":"VLOOKUP(A9,saisie!B$7:AL$26,30,0)","v":88},{"$f":"VLOOKUP(A9,saisie!B$7:AL$26,31,0)","v":83},{"$f":"VLOOKUP(A9,saisie!B$7:AL$26,32,0)","v":262},{"$f":"VLOOKUP(A9,saisie!B$7:AL$26,33,0)","v":0},{"$f":"VLOOKUP(A9,saisie!B$7:AL$26,34,0)","v":1268},{"$f":"VLOOKUP(A9,saisie!B$7:AL$26,35,0)","v":0}]
[{"$f":"IF(INFO!B8>3,4,\"\")","v":4},{"$f":"VLOOKUP(A10,saisie!B$7:AL$26,2,0)","v":"SAINTES S.S.T"},{"$f":"VLOOKUP(A10,saisie!B$7:AL$26,3,0)","v":1717031},{"$f":"VLOOKUP(A10,saisie!B$7:AL$26,4,0)","v":"JACQUES Christophe"},{"$f":"VLOOKUP(A10,saisie!B$7:AL$26,5,0)","v":89},{"$f":"VLOOKUP(A10,saisie!B$7:AL$26,6,0)","v":88},{"$f":"VLOOKUP(A10,saisie!B$7:AL$26,7,0)","v":88},{"$f":"VLOOKUP(A10,saisie!B$7:AL$26,8,0)","v":265},{"$f":"VLOOKUP(A10,saisie!B$7:AL$26,9,0)","v":0},{"$f":"VLOOKUP(A10,saisie!B$7:AL$26,10,0)","v":"RABAT Catherine"},{"$f":"VLOOKUP(A10,saisie!B$7:AL$26,11,0)","v":52},{"$f":"VLOOKUP(A10,saisie!B$7:AL$26,12,0)","v":46},{"$f":"VLOOKUP(A10,saisie!B$7:AL$26,13,0)","v":33},{"$f":"VLOOKUP(A10,saisie!B$7:AL$26,14,0)","v":131},{"$f":"VLOOKUP(A10,saisie!B$7:AL$26,15,0)","v":0},{"$f":"VLOOKUP(A10,saisie!B$7:AL$26,16,0)","v":"SOULIER Jean"},{"$f":"VLOOKUP(A10,saisie!B$7:AL$26,17,0)","v":81},{"$f":"VLOOKUP(A10,saisie!B$7:AL$26,18,0)","v":84},{"$f":"VLOOKUP(A10,saisie!B$7:AL$26,19,0)","v":83},{"$f":"VLOOKUP(A10,saisie!B$7:AL$26,20,0)","v":248},{"$f":"VLOOKUP(A10,saisie!B$7:AL$26,21,0)","v":0},{"$f":"VLOOKUP(A10,saisie!B$7:AL$26,22,0)","v":"BOIN Bertrand"},{"$f":"VLOOKUP(A10,saisie!B$7:AL$26,23,0)","v":71},{"$f":"VLOOKUP(A10,saisie!B$7:AL$26,24,0)","v":75},{"$f":"VLOOKUP(A10,saisie!B$7:AL$26,25,0)","v":79},{"$f":"VLOOKUP(A10,saisie!B$7:AL$26,26,0)","v":225},{"$f":"VLOOKUP(A10,saisie!B$7:AL$26,27,0)","v":0},{"$f":"VLOOKUP(A10,saisie!B$7:AL$26,28,0)","v":"FLEURET Eric"},{"$f":"VLOOKUP(A10,saisie!B$7:AL$26,29,0)","v":92},{"$f":"VLOOKUP(A10,saisie!B$7:AL$26,30,0)","v":90},{"$f":"VLOOKUP(A10,saisie!B$7:AL$26,31,0)","v":91},{"$f":"VLOOKUP(A10,saisie!B$7:AL$26,32,0)","v":273},{"$f":"VLOOKUP(A10,saisie!B$7:AL$26,33,0)","v":0},{"$f":"VLOOKUP(A10,saisie!B$7:AL$26,34,0)","v":1142},{"$f":"VLOOKUP(A10,saisie!B$7:AL$26,35,0)","v":0}]
{"$rows_left_out":37}
{"sheet":"Clb Q (2)","index":3,"n_rows":31,"n_cols":15,"rows_kept":31,"cut":false,"hidden":true,"merged":[]}
[null,"CLUB N°1",{"$f":"'M Q'!B7","v":"ROCHEFORT   T.S.R"},null,null,{"$f":"'M Q'!AH7","v":1312},null,null,null,{"$f":"IF(INFO!B8>7,\"CLUB N°8\",\"\")","v":""},{"$f":"'M Q'!B14","v":{"$error":"#N/A"}},null,null,{"$f":"'M Q'!AH14","v":{"$error":"#N/A"}}]
[null,"NOMS","série 1","série 2","série 3","POINTS",null,null,null,"NOMS","série 1","série 2","série 3","POINTS"]
[{"$f":"F3+0.0001*G3+0.0000001*E3+0.0000000001*D3","v":267.00000880900001},{"$f":"'M Q'!D7","v":"BAUDET Philippe"},{"$f":"'M Q'!E7","v":89},{"$f":"'M Q'!F7","v":90},{"$f":"'M Q'!G7","v":88},{"$f":"'M Q'!H7","v":267},{"$f":"'M Q'!I7","v":0},null,{"$f":"N3+0.0001*O3+0.0000001*M3+0.0000000001*L3","v":{"$error":"#N/A"}},{"$f":"'M Q'!D14","v":{"$error":"#N/A"}},{"$f":"'M Q'!E14","v":{"$error":"#N/A"}},{"$f":"'M Q'!F14","v":{"$error":"#N/A"}},{"$f":"'M Q'!G14","v":{"$error":"#N/A"}},{"$f":"'M Q'!H14","v":{"$error":"#N/A"}},{"$f":"'M Q'!I14","v":{"$error":"#N/A"}}]
[{"$f":"F4+0.0001*G4+0.0000001*E4+0.0000000001*D4","v":281.00000950909998},{"$f":"'M Q'!J7","v":"BERGOGNE Cyril"},{"$f":"'M Q'!K7","v":95},{"$f":"'M Q'!L7","v":91},{"$f":"'M Q'!M7","v":95},{"$f":"'M Q'!N7","v":281},{"$f":"'M Q'!O7","v":0},null,{"$f":"N4+0.0001*O4+0.0000001*M4+0.0000000001*L4","v":{"$error":"#N/A"}},{"$f":"'M Q'!J14","v":{"$error":"#N/A"}},{"$f":"'M Q'!K14","v":{"$error":"#N/A"}},{"$f":"'M Q'!L14","v":{"$error":"#N/A"}},{"$f":"'M Q'!M14","v":{"$error":"#N/A"}},{"$f":"'M Q'!N14","v":{"$error":"#N/A"}},{"$f":"'M Q'!O14","v":{"$error":"#N/A"}}]
[{"$f":"F5+0.0001*G5+0.0000001*E5+0.0000000001*D5","v":261.00000860879999},{"$f":"'M Q'!P7","v":"MERCIER Rémy"},{"$f":"'M Q'!Q7","v":87},{"$f":"'M Q'!R7","v":88},{"$f":"'M Q'!S7","v":86},{"$f":"'M Q'!T7","v":261},{"$f":"'M Q'!U7","v":0},null,{"$f":"N5+0.0001*O5+0.0000001*M5+0.0000000001*L5","v":{"$error":"#N/A"}},{"$f":"'M Q'!P14","v":{"$error":"#N/A"}},{"$f":"'M Q'!Q14","v":{"$error":"#N/A"}},{"$f":"'M Q'!R14","v":{"$error":"#N/A"}},{"$f":"'M Q'!S14","v":{"$error":"#N/A"}},{"$f":"'M Q'!T14","v":{"$error":"#N/A"}},{"$f":"'M Q'!U14","v":{"$error":"#N/A"}}]
[{"$f":"F6+0.0001*G6+0.0000001*E6+0.0000000001*D6","v":234.00000770739999},{"$f":"'M Q'!V7","v":"BRIAND Ptrick"},{"$f":"'M Q'!W7","v":83},{"$f":"'M Q'!X7","v":74},{"$f":"'M Q'!Y7","v":77},{"$f":"'M Q'!Z7","v":234},{"$f":"'M Q'!AA7","v":0},null,{"$f":"N6+0.0001*O6+0.0000001*M6+0.0000000001*L6","v":{"$error":"#N/A"}},{"$f":"'M Q'!V14","v":{"$error":"#N/A"}},{"$f":"'M Q'!W14","v":{"$error":"#N/A"}},{"$f":"'M Q'!X14","v":{"$error":"#N/A"}},{"$f":"'M Q'!Y14","v":{"$error":"#N/A"}},{"$f":"'M Q'!Z14","v":{"$error":"#N/A"}},{"$f":"'M Q'!AA14","v":{"$error":"#N/A"}}]
[{"$f":"F7+0.0001*G7+0.0000001*E7+0.0000000001*D7","v":269.00000910900002},{"$f":"'M Q'!AB7","v":"MERCIER Mickael"},{"$f":"'M Q'!AC7","v":88},{"$f":"'M Q'!AD7","v":90},{"$f":"'M Q'!AE7","v":91},{"$f":"'M Q'!AF7","v":269},{"$f":"'M Q'!AG7","v":0},null,{"$f":"N7+0.0001*O7+0.0000001*M7+0.0000000001*L7","v":{"$error":"#N/A"}},{"$f":"'M Q'!AB14","v":{"$error":"#N/A"}},{"$f":"'M Q'!AC14","v":{"$error":"#N/A"}},{"$f":"'M Q'!AD14","v":{"$error":"#N/A"}},{"$f":"'M Q'!AE14","v":{"$error":"#N/A"}},{"$f":"'M Q'!AF14","v":{"$error":"#N/A"}},{"$f":"'M Q'!AG14","v":{"$error":"#N/A"}}]
[]
[null,"CLUB N°2",{"$f":"'M Q'!B8","v":"PONS   A.P.T.S"},null,null,{"$f":"'M Q'!AH8","v":1278},null,null,null,{"$f":"IF(INFO!B8>6,\"CLUB N°7\",\"\")","v":""},{"$f":"'M Q'!B13","v":{"$error":"#N/A"}},null,null,{"$f":"'M Q'!AH13","v":{"$error":"#N/A"}}]
[null,"NOMS","série 1","série 2","série 3","POINTS",null,null,null,"NOMS","série 1","série 2","série 3","POINTS"]
{"$rows_left_out":22}
{"sheet":"Clb Q","index":4,"n_rows":32,"n_cols":12,"rows_kept":32,"cut":false,"hidden":false,"merged":[[0,1,0,11],[25,2,25,4],[25,8,25,10],[17,2,17,4],[17,8,17,10],[1,2,1,4],[1,8,1,10],[9,2,9,4],[9,8,9,10]]}
[null,"CLUBS QUALIFIES EN PHASE FINALE"]
[null,"CLUB N°1",{"$f":"'Clb Q (2)'!C1","v":"ROCHEFORT   T.S.R"},null,null,{"$f":"'Clb Q (2)'!F1","v":1312},null,{"$f":"IF(INFO!B8>7,\"CLUB N°8\",\"\")","v":""},{"$f":"IF(INFO!B8>7,'Clb Q (2)'!K1,\"\")","v":""},null,null,{"$f":"IF(INFO!B8>7,'Clb Q (2)'!N1,\"\")","v":""}]
[null,"NOMS","série 1","série 2","série 3","POINTS",null,"NOMS","série 1","série 2","série 3","POINTS"]
[null,{"$f":"VLOOKUP(F4,'Clb Q (2)'!A$3:G$7,2,0)","v":"BERGOGNE Cyril"},{"$f":"VLOOKUP(F4,'Clb Q (2)'!A$3:G$7,3,0)","v":95},{"$f":"VLOOKUP(F4,'Clb Q (2)'!A$3:G$7,4,0)","v":91},{"$f":"VLOOKUP(F4,'Clb Q (2)'!A$3:G$7,5,0)","v":95},{"$f":"LARGE('Clb Q (2)'!A$3:A$7,1)","v":281.00000950909998},null,{"$f":"IF(INFO!B$8>7,VLOOKUP(L4,'Clb Q (2)'!I$3:O$7,2,0),\"\")","v":""},{"$f":"IF(INFO!B$8>7,VLOOKUP(L4,'Clb Q (2)'!I$3:O$7,3,0),\"\")","v":""},{"$f":"IF(INFO!B$8>7,VLOOKUP(L4,'Clb Q (2)'!I$3:O$7,4,0),\"\")","v":""},{"$f":"IF(INFO!B$8>7,VLOOKUP(L4,'Clb Q (2)'!I$3:O$7,5,0),\"\")","v":""},{"$f":"IF(INFO!B$8>7,LARGE('Clb Q (2)'!I$3:I$7,1),\"\")","v":""}]
[null,{"$f":"VLOOKUP(F5,'Clb Q (2)'!A$3:G$7,2,0)","v":"MERCIER Mickael"},{"$f":"VLOOKUP(F5,'Clb Q (2)'!A$3:G$7,3,0)","v":88},{"$f":"VLOOKUP(F5,'Clb Q (2)'!A$3:G$7,4,0)","v":90},{"$f":"VLOOKUP(F5,'Clb Q (2)'!A$3:G$7,5,0)","v":91},{"$f":"LARGE('Clb Q (2)'!A$3:A$7,2)","v":269.00000910900002},null,{"$f":"IF(INFO!B$8>7,VLOOKUP(L5,'Clb Q (2)'!I$3:O$7,2,0),\"\")","v":""},{"$f":"IF(INFO!B$8>7,VLOOKUP(L5,'Clb Q (2)'!I$3:O$7,3,0),\"\")","v":""},{"$f":"IF(INFO!B$8>7,VLOOKUP(L5,'Clb Q (2)'!I$3:O$7,4,0),\"\")","v":""},{"$f":"IF(INFO!B$8>7,VLOOKUP(L5,'Clb Q (2)'!I$3:O$7,5,0),\"\")","v":""},{"$f":"IF(INFO!B$8>7,LARGE('Clb Q (2)'!I$3:I$7,2),\"\")","v":""}]
[null,{"$f":"VLOOKUP(F6,'Clb Q (2)'!A$3:G$7,2,0)","v":"BAUDET Philippe"},{"$f":"VLOOKUP(F6,'Clb Q (2)'!A$3:G$7,3,0)","v":89},{"$f":"VLOOKUP(F6,'Clb Q (2)'!A$3:G$7,4,0)","v":90},{"$f":"VLOOKUP(F6,'Clb Q (2)'!A$3:G$7,5,0)","v":88},{"$f":"LARGE('Clb Q (2)'!A$3:A$7,3)","v":267.00000880900001},null,{"$f":"IF(INFO!B$8>7,VLOOKUP(L6,'Clb Q (2)'!I$3:O$7,2,0),\"\")","v":""},{"$f":"IF(INFO!B$8>7,VLOOKUP(L6,'Clb Q (2)'!I$3:O$7,3,0),\"\")","v":""},{"$f":"IF(INFO!B$8>7,VLOOKUP(L6,'Clb Q (2)'!I$3:O$7,4,0),\"\")","v":""},{"$f":"IF(INFO!B$8>7,VLOOKUP(L6,'Clb Q (2)'!I$3:O$7,5,0),\"\")","v":""},{"$f":"IF(INFO!B$8>7,LARGE('Clb Q (2)'!I$3:I$7,3),\"\")","v":""}]
[null,{"$f":"VLOOKUP(F7,'Clb Q (2)'!A$3:G$7,2,0)","v":"MERCIER Rémy"},{"$f":"VLOOKUP(F7,'Clb Q (2)'!A$3:G$7,3,0)","v":87},{"$f":"VLOOKUP(F7,'Clb Q (2)'!A$3:G$7,4,0)","v":88},{"$f":"VLOOKUP(F7,'Clb Q (2)'!A$3:G$7,5,0)","v":86},{"$f":"LARGE('Clb Q (2)'!A$3:A$7,4)","v":261.00000860879999},null,{"$f":"IF(INFO!B$8>7,VLOOKUP(L7,'Clb Q (2)'!I$3:O$7,2,0),\"\")","v":""},{"$f":"IF(INFO!B$8>7,VLOOKUP(L7,'Clb Q (2)'!I$3:O$7,3,0),\"\")","v":""},{"$f":"IF(INFO!B$8>7,VLOOKUP(L7,'Clb Q (2)'!I$3:O$7,4,0),\"\")","v":""},{"$f":"IF(INFO!B$8>7,VLOOKUP(L7,'Clb Q (2)'!I$3:O$7,5,0),\"\")","v":""},{"$f":"IF(INFO!B$8>7,LARGE('Clb Q (2)'!I$3:I$7,4),\"\")","v":""}]
[null,{"$f":"VLOOKUP(F8,'Clb Q (2)'!A$3:G$7,2,0)","v":"BRIAND Ptrick"},{"$f":"VLOOKUP(F8,'Clb Q (2)'!A$3:G$7,3,0)","v":83},{"$f":"VLOOKUP(F8,'Clb Q (2)'!A$3:G$7,4,0)","v":74},{"$f":"VLOOKUP(F8,'Clb Q (2)'!A$3:G$7,5,0)","v":77},{"$f":"LARGE('Clb Q (2)'!A$3:A$7,5)","v":234.00000770739999},null,{"$f":"IF(INFO!B$8>7,VLOOKUP(L8,'Clb Q (2)'!I$3:O$7,2,0),\"\")","v":""},{"$f":"IF(INFO!B$8>7,VLOOKUP(L8,'Clb Q (2)'!I$3:O$7,3,0),\"\")","v":""},{"$f":"IF(INFO!B$8>7,VLOOKUP(L8,'Clb Q (2)'!I$3:O$7,4,0),\"\")","v":""},{"$f":"IF(INFO!B$8>7,VLOOKUP(L8,'Clb Q (2)'!I$3:O$7,5,0),\"\")","v":""},{"$f":"IF(INFO!B$8>7,LARGE('Clb Q (2)'!I$3:I$7,5),\"\")","v":""}]
[]
[null,"CLUB N°2",{"$f":"'Clb Q (2)'!C9","v":"PONS   A.P.T.S"},null,null,{"$f":"'Clb Q (2)'!F9","v":1278},null,{"$f":"IF(INFO!B8>6,\"CLUB N°7\",\"\")","v":""},{"$f":"IF(INFO!B8>6,'Clb Q (2)'!K9,\"\")","v":""},null,null,{"$f":"IF(INFO!B8>6,'Clb Q (2)'!N9,\"\")","v":""}]
{"$rows_left_out":23}
{"sheet":"P.F.","index":5,"n_rows":77,"n_cols":21,"rows_kept":77,"cut":false,"hidden":false,"merged":[[54,12,54,14],[70,7,76,8],[70,13,76,14],[56,10,56,11],[57,10,57,11],[58,10,58,11],[59,10,59,11],[60,10,60,11],[69,7,69,9],[69,12,69,14],[68,12,68,14],[64,12,64,14],[55,7,55,9],[55,12,55,14],[67,7,67,9],[67,12,67,14],[66,12,66,14],[56,7,62,8],[56,13,62,14],[65,12,65,14],[62,10,62,11],[72,10,72,11],[73,10,73,11],[1,1,1,20],[6,2,6,4],[7,2,7,4],[6,7,6,9],[7,7,7,9],[6,12,6,14],[6,17,6,19],[5,17,5,19],[4,7,4,9],[7,12,7,14],[5,2,5,4],[5,7,5,9],[5,12,5,14],[3,1,3,20],[4,15,4,16],[4,17,4,19],[4,2,4,4],[4,5,4,6],[4,12,4,14],[2,1,2,20],[7,17,7,19],[9,12,9,14],[10,2,16,3],[10,8,16,9],[9,2,9,4],[20,2,20,4],[24,2,30,3],[24,12,30,13],[22,12,22,14],[24,8,30,9],[19,7,19,9],[16,5,16,6],[18,5,18,6],[18,7,18,9],[21,2,21,4],[10,5,10,6],[11,5,11,6],[14,5,14,6],[12,5,12,6],[13,5,13,6],[19,2,19,4],[34,5,34,6],[34,7,34,9],[34,12,34,14],[24,5,24,6],[18,2,18,4],[37,12,37,14],[21,7,21,9],[20,12,20,14],[21,12,21,14],[23,2,23,4],[23,7,23,9],[20,7,20,9],[27,5,27,6],[26,5,26,6],[30,5,30,6],[22,2,22,4],[22,7,22,9],[35,2,35,4],[35,7,35,9],[35,12,35,14],[33,1,33,20],[34,2,34,4],[20,17,20,19],[21,17,21,19],[10,18,16,19],[18,17,18,19],[15,15,15,16],[50,12,50,14],[40,18,46,19],[23,12,23,14],[34,17,34,19],[16,15,16,16],[26,15,26,16],[27,15,27,16],[10,15,10,16],[13,15,13,16],[30,15,30,16],[43,15,43,16],[44,15,44,16],[45,15,45,16],[46,15,46,16],[39,17,39,19],[38,12,38,14],[38,17,38,19],[35,17,35,19],[24,18,30,19],[37,17,37,19],[36,17,36,19],[50,7,50,9],[50,10,50,11],[54,7,54,9],[43,5,43,6],[52,7,52,9],[53,7,53,9],[40,5,40,6],[41,5,41,6],[42,5,42,6],[44,5,44,6],[45,5,45,6],[46,5,46,6],[36,2,36,4],[37,2,37,4],[37,7,37,9],[36,7,36,9],[36,12,36,14],[40,2,46,3],[40,8,46,9],[40,15,40,16],[41,15,41,16],[42,15,42,16],[38,2,38,4],[38,7,38,9],[39,2,39,4],[39,7,39,9],[8,2,8,4],[8,12,8,14],[25,5,25,6],[28,5,28,6],[29,5,29,6],[19,17,19,19],[19,12,19,14],[24,15,24,16],[23,17,23,19],[8,17,8,19],[9,17,9,19],[22,17,22,19],[9,7,9,9],[8,7,8,9],[18,12,18,14],[18,15,18,16],[11,15,11,16],[14,15,14,16],[10,12,16,13],[12,15,12,16],[15,5,15,6],[25,15,25,16],[28,15,28,16],[29,15,29,16],[64,5,69,6],[74,10,74,11],[75,10,75,11],[76,10,76,11],[71,10,71,11],[34,15,34,16],[40,12,46,13],[50,15,55,16],[70,10,70,11],[49,7,49,14],[39,12,39,14],[64,15,69,16],[64,7,64,9],[64,10,64,11],[52,12,52,14],[51,7,51,9],[51,12,51,14],[65,7,65,9],[66,7,66,9],[63,7,63,14],[68,7,68,9],[53,12,53,14],[61,10,61,11],[50,5,55,6]]}
[]
[null,{"$f":"CONCATENATE(INFO!B7,\" - \",INFO!B9)","v":"PISTOLET - POITOU-CHARENTES"}]
[]
[null,"1er TOUR        1/4 FINALES         2e  TOUR"]
[null,null,{"$f":"'Clb Q'!C2","v":"ROCHEFORT   T.S.R"},null,null,"POSTE",null,{"$f":"'Clb Q'!I2","v":""},null,null,null,null,{"$f":"'Clb Q'!C18","v":"JONZAC   S.J.T"},null,null,"POSTE",null,{"$f":"'Clb Q'!I18","v":""}]
[null,null,{"$f":"'Clb Q'!B4","v":"BERGOGNE Cyril"},null,null,1,2,{"$f":"'Clb Q'!H4","v":""},null,null,null,null,{"$f":"'Clb Q'!B20","v":"ACHTOUK Kenza"},null,null,1,2,{"$f":"'Clb Q'!H20","v":""}]
[null,null,{"$f":"'Clb Q'!B5","v":"MERCIER Mickael"},null,null,3,4,{"$f":"'Clb Q'!H5","v":""},null,null,null,null,{"$f":"'Clb Q'!B21","v":"CORMELIER Hervé"},null,null,3,4,{"$f":"'Clb Q'!H21","v":""}]
[null,null,{"$f":"'Clb Q'!B6","v":"BAUDET Philippe"},null,null,5,6,{"$f":"'Clb Q'!H6","v":""},null,null,null,null,{"$f":"'Clb Q'!B22","v":"ARRIGONI Stéphane"},null,null,5,6,{"$f":"'Clb Q'!H22","v":""}]
[null,null,{"$f":"'Clb Q'!B7","v":"MERCIER Rémy"},null,null,7,8,{"$f":"'Clb Q'!H7","v":""},null,null,null,null,{"$f":"'Clb Q'!B23","v":"GIOVANNONE Philippe"},null,null,7,8,{"$f":"'Clb Q'!H23","v":""}]
[null,null,{"$f":"'Clb Q'!B8","v":"BRIAND Ptrick"},null,null,9,10,{"$f":"'Clb Q'!H8","v":""},null,null,null,null,{"$f":"'Clb Q'!B24","v":"SOURIS Christine"},null,null,9,10,{"$f":"'Clb Q'!H24","v":""}]
{"$rows_left_out":68}
{"sheet":"PALMARES","index":6,"n_rows":27,"n_cols":13,"rows_kept":27,"cut":false,"hidden":false,"merged":[[0,0,2,7],[3,0,3,7],[10,9,10,12],[11,6,14,6],[7,6,8,6],[9,6,10,6],[4,0,4,7]]}
[{"$f":"CONCATENATE(\"PALMARES\",\"  \",INFO!B6,\"\n\",\"CHAMPIONNAT DE FRANCE DES CLUBS\",\"\n\",\"10 METRES\")","v":"PALMARES  2021-2022\nCHAMPIONNAT DE FRANCE DES CLUBS\n10 METRES"}]
[]
[]
[{"$f":"CONCATENATE(INFO!B7,\"   \",INFO!B9)","v":"PISTOLET   POITOU-CHARENTES"}]
[]
[]
["PLACE","CLUBS","LIGUE","n° CLUB","M Q","Bar."]
[1,{"$f":"IF(A8=\"\",\"\",IF(P.F.!J71=\"\",\"\",IF(P.F.!H71>3,P.F.!H65,IF(P.F.!N71>3,P.F.!M65,\"\"))))","v":"ROCHEFORT   T.S.R"},null,{"$f":"IF(A8=\"\",\"\",IF(B8=\"\",\"\",VLOOKUP(B8,'M Q'!B$7:AI$14,2,0)))","v":1717160},{"$f":"IF(A8=\"\",\"\",IF(B8=\"\",\"\",VLOOKUP(B8,'M Q'!B$7:AI$14,33,0)))","v":1312},{"$f":"IF(A8=\"\",\"\",IF(B8=\"\",\"\",VLOOKUP(B8,'M Q'!B$7:AI$14,34,0)))","v":0},"FINALE"]
[{"$f":"IF(INFO!B8>1,2,\"\")","v":2},{"$f":"IF(A9=\"\",\"\",IF(P.F.!M71=\"\",\"\",IF(P.F.!H71>3,P.F.!M65,IF(P.F.!N71>3,P.F.!H65,\"\"))))","v":"PONS   A.P.T.S"},null,{"$f":"IF(A9=\"\",\"\",IF(B9=\"\",\"\",VLOOKUP(B9,'M Q'!B$7:AI$14,2,0)))","v":1717100},{"$f":"IF(A9=\"\",\"\",IF(B9=\"\",\"\",VLOOKUP(B9,'M Q'!B$7:AI$14,33,0)))","v":1278},{"$f":"IF(A9=\"\",\"\",IF(B9=\"\",\"\",VLOOKUP(B9,'M Q'!B$7:AI$14,34,0)))","v":0}]
[{"$f":"IF(INFO!B8>2,3,\"\")","v":3},{"$f":"IF(A10=\"\",\"\",IF(INFO!B8=3,P.F.!M51,IF(P.F.!J57=\"\",\"\",IF(P.F.!H57>3,P.F.!H51,IF(P.F.!N57>3,P.F.!M51,\"\")))))","v":"SAINTES S.S.T"},null,{"$f":"IF(A10=\"\",\"\",IF(B10=\"\",\"\",VLOOKUP(B10,'M Q'!B$7:AI$14,2,0)))","v":1717031},{"$f":"IF(A10=\"\",\"\",IF(B10=\"\",\"\",VLOOKUP(B10,'M Q'!B$7:AI$14,33,0)))","v":1142},{"$f":"IF(A10=\"\",\"\",IF(B10=\"\",\"\",VLOOKUP(B10,'M Q'!B$7:AI$14,34,0)))","v":0},"PETITE\nFINALE"]
{"$rows_left_out":17}