{"text_format":"1","workbook":"xlsx","n_sheets":7,"sheets":["INFO","saisie","M Q","Clb Q (2)","Clb Q","P.F.","PALMARES"],"not_rendered":{"charts":0,"images":3,"macros":0,"external_links":0,"defined_names":7,"comments":0,"pivot_tables":0},"unopened":[],"bounds":{"document_bytes":16777216,"sheet_cells":100000,"rows_first":2000,"rows_last":500,"rows_between":2000,"halvings":0,"cell_chars":16384,"cell_head_chars":4096},"cells_cut":0,"cells_raw":0,"read":"whole","date_system":"1904"}

{"sheet":"INFO","index":0,"n_rows":19,"n_cols":3,"rows_kept":19,"cut":false,"hidden":false,"merged":[[0,0,0,2],[1,0,1,2],[15,0,15,2],[18,0,18,1],[2,0,2,2],[10,0,10,2],[16,0,16,1],[17,0,17,1]]}
["PROGRAMME DE GESTION \nCHAMPIONNAT DE FRANCE DES CLUBS\n10 METRES"]
[]
["COMPETITION"]
["date :","15 et 16 janvier 2021"]
["lieu :","PONS"]
["saison :","2021-2022"]
["Discipline :","PISTOLET","(CARABINE ou PISTOLET)"]
["Nombre d'équipe :",4]
["LIGUE :","POITOU-CHARENTES","(EN MAJUSCULE)"]
[]
["RESPONSABLE DE LA SAISIE"]
["NOM Prénom :","POISSONNET Pierre"]
["téléphone :","06 85 47 62 84"]
["adresse électronique :","gestcompte@cd-tir-17.org"]
[]
["Ce programme n'est pas protégé, je vous conseille d'en créer une copie avant utilisation afin de pallier à de possibles erreurs de manipulation. Pour tout problème lié aux règlements, veuillez consulter le document : mode d'emploi cdfc 10m.pdf.\n\nPour toute information complémentaire ou modification particulière, contacter :"]
["Monsieur Philippe QUENTEL"]
["pquentel@fftir.org"]
["01 58 05 45 32"]

{"sheet":"saisie","index":1,"n_rows":26,"n_cols":38,"rows_kept":26,"cut":false,"hidden":false,"merged":[[4,23,4,25],[4,26,5,26],[4,9,5,9],[4,15,5,15],[4,33,5,33],[4,29,4,31],[4,32,5,32],[4,20,5,20],[0,0,1,28],[2,0,3,35],[4,37,5,37],[4,35,5,35],[4,21,5,21],[4,27,5,27],[4,0,5,0],[4,2,5,2],[4,3,5,3],[4,5,4,7],[4,8,5,8],[4,11,4,13],[4,14,5,14],[4,17,4,19],[4,1,5,1],[4,34,5,34]]}
[]
[]
[{"$f":"CONCATENATE(\"MATCH DE QUALIFICATION\",\" - \",INFO!B7,\" - \",INFO!B9)","v":"MATCH DE QUALIFICATION - PISTOLET - POITOU-CHARENTES"}]
[]
["POSTE","Cl.","CLUB","N° club","Nom","Séries",null,null,"Total","M*","Nom","Séries",null,null,"Total","M*","Nom","Séries",null,null,"Total","M*","Nom","Séries",null,null,"Total","M*","Nom","Séries",null,null,"Total","M*","TT","Bar.",null,"TOTAL"]
[null,null,null,null,"1er Tireur",1,2,3,null,null,"2ème Tireur",1,2,3,null,null,"3ème Tireur",1,2,3,null,null,"4ème Tireur",1,2,3,null,null,"5ème Tireur",1,2,3]
[1,{"$f":"RANK(AL7,$AL$7:$AL$26,0)","v":3},"JONZAC   S.J.T",1717165,"GIOVANNONE Philippe",84,80,83,{"$f":"SUM(F7:H7)","v":247},null,"SOURIS Christine",81,75,81,{"$f":"SUM(L7:N7)","v":237},null,"ACHTOUK Kenza",92,92,88,{"$f":"SUM(R7:T7)","v":272},null,"ARRIGONI Stéphane",80,81,89,{"$f":"SUM(X7:Z7)","v":250},null,"CORMELIER Hervé",91,88,83,{"$f":"SUM(AD7:AF7)","v":262},null,{"$f":"SUM(I7+O7+U7+AA7+AG7)","v":1268},{"$f":"J7+P7+V7+AB7+AH7","v":0},null,{"$f":"I7+O7+U7+AA7+AG7+(0.000001*(J7+P7+V7+AB7+AH7))+(0.000000001*(H7+N7+T7+Z7+AF7))+(0.000000000001*(G7+M7+S7+Y7+AE7))","v":1268.0000004244162}]
[2,2,"PONS   A.P.T.S",1717100,"DEBAIN Nathalie",80,82,75,{"$f":"SUM(F8:H8)","v":237},null,"ROUSSEAU Valérie",83,82,92,{"$f":"SUM(L8:N8)","v":257},null,"ROUSSEAU Thierry",87,83,85,{"$f":"SUM(R8:T8)","v":255},null,"POULLY Pascal",84,86,89,{"$f":"SUM(X8:Z8)","v":259},null,"BERNARD Kevin",89,90,91,{"$f":"SUM(AD8:AF8)","v":270},null,{"$f":"SUM(I8+O8+U8+AA8+AG8)","v":1278},{"$f":"J8+P8+V8+AB8+AH8","v":0},null,{"$f":"I8+O8+U8+AA8+AG8+(0.000001*(J8+P8+V8+AB8+AH8))+(0.000000001*(H8+N8+T8+Z8+AF8))+(0.000000000001*(G8+M8+S8+Y8+AE8))","v":1278.0000004324229}]
[3,1,"ROCHEFORT   T.S.R",1717160,"BAUDET Philippe",89,90,88,{"$f":"SUM(F9:H9)","v":267},null,"BERGOGNE Cyril",95,91,95,{"$f":"SUM(L9:N9)","v":281},null,"MERCIER Rémy",87,88,86,{"$f":"SUM(R9:T9)","v":261},null,"BRIAND Ptrick",83,74,77,{"$f":"SUM(X9:Z9)","v":234},null,"MERCIER Mickael",88,90,91,{"$f":"SUM(AD9:AF9)","v":269},null,{"$f":"SUM(I9+O9+U9+AA9+AG9)","v":1312},0,null,1312.0000004374328]
[4,4,"SAINTES S.S.T",1717031,"JACQUES Christophe",89,88,88,{"$f":"SUM(F10:H10)","v":265},null,"RABAT Catherine",52,46,33,{"$f":"SUM(L10:N10)","v":131},null,"SOULIER Jean",81,84,83,{"$f":"SUM(R10:T10)","v":248},null,"BOIN Bertrand",71,75,79,{"$f":"SUM(X10:Z10)","v":225},null,"FLEURET Eric",92,90,91,{"$f":"SUM(AD10:AF10)","v":273},null,{"$f":"SUM(I10+O10+U10+AA10+AG10)","v":1142},0,null,1142.0000003743828]
[5,5,null,null,null,null,null,null,0,null,null,null,null,null,0,null,null,null,null,null,0,null,null,null,null,null,0,null,null,null,null,null,0,null,0,0,null,0]
[6,5,null,null,null,null,null,null,0,null,null,null,null,null,0,null,null,null,null,null,0,null,null,null,null,null,0,null,null,null,null,null,0,null,0,0,null,0]
[7,5,null,null,null,null,null,null,0,null,null,null,null,null,0,null,null,null,null,null,0,null,null,null,null,null,0,null,null,null,null,null,0,null,0,0,null,0]
[8,5,null,null,null,null,null,null,0,null,null,null,null,null,0,null,null,null,null,null,0,null,null,null,null,null,0,null,null,null,null,null,0,null,0,0,null,0]
[9,5,null,null,null,null,null,null,0,null,null,null,null,null,0,null,null,null,null,null,0,null,null,null,null,null,0,null,null,null,null,null,0,null,0,0,null,0]
[10,5,null,null,null,null,null,null,0,null,null,null,null,null,0,null,null,null,null,null,0,null,null,null,null,null,0,null,null,null,null,null,0,null,0,0,null,0]
[11,5,null,null,null,null,null,null,0,null,null,null,null,null,0,null,null,null,null,null,0,null,null,null,null,null,0,null,null,null,null,null,0,null,0,0,null,0]
[12,5,null,null,null,null,null,null,0,null,null,null,null,null,0,null,null,null,null,null,0,null,null,null,null,null,0,null,null,null,null,null,0,null,0,0,null,0]
[13,5,null,null,null,null,null,null,0,null,null,null,null,null,0,null,null,null,null,null,0,null,null,null,null,null,0,null,null,null,null,null,0,null,0,0,null,0]
[14,5,null,null,null,null,null,null,0,null,null,null,null,null,0,null,null,null,null,null,0,null,null,null,null,null,0,null,null,null,null,null,0,null,0,0,null,0]
[15,5,null,null,null,null,null,null,0,null,null,null,null,null,0,null,null,null,null,null,0,null,null,null,null,null,0,null,null,null,null,null,0,null,0,0,null,0]
[16,5,null,null,null,null,null,null,0,null,null,null,null,null,0,null,null,null,null,null,0,null,null,null,null,null,0,null,null,null,null,null,0,null,0,0,null,0]
[17,5,null,null,null,null,null,null,0,null,null,null,null,null,0,null,null,null,null,null,0,null,null,null,null,null,0,null,null,null,null,null,0,null,0,0,null,0]
[18,5,null,null,null,null,null,null,0,null,null,null,null,null,0,null,null,null,null,null,0,null,null,null,null,null,0,null,null,null,null,null,0,null,0,0,null,0]
[19,5,null,null,null,null,null,null,0,null,null,null,null,null,0,null,null,null,null,null,0,null,null,null,null,null,0,null,null,null,null,null,0,null,0,0,null,0]
[20,5,null,null,null,null,null,null,0,null,null,null,null,null,0,null,null,null,null,null,0,null,null,null,null,null,0,null,null,null,null,null,0,null,0,0,null,0]

{"sheet":"M Q","index":2,"n_rows":46,"n_cols":35,"rows_kept":46,"cut":false,"hidden":false,"merged":[[2,0,3,34],[4,35,5,35],[4,0,5,0],[4,7,5,7],[4,34,5,34],[4,1,5,1],[4,13,5,13],[4,19,5,19],[4,25,5,25],[4,33,5,33],[4,2,5,2],[4,31,5,31],[4,8,5,8],[4,14,5,14],[4,20,5,20],[4,26,5,26],[4,32,5,32],[4,4,5,6],[4,10,5,12],[4,16,5,18],[4,22,5,24],[4,28,5,30],[4,3,5,3],[4,9,5,9],[4,15,5,15],[4,21,5,21],[4,27,5,27]]}
[]
[]
[{"$f":"CONCATENATE(\"MATCH DE QUALIFICATION\",\" - \",INFO!B7,\" - \",INFO!B9)","v":"MATCH DE QUALIFICATION - PISTOLET - POITOU-CHARENTES"}]
[]
["Cl.","CLUB","N° club","1er Tireur","séries",null,null,"Total","M*","2ème Tireur","séries",null,null,"Total","M*","3ème Tireur","séries",null,null,"Total","M*","4ème Tireur","séries",null,null,"Total","M*","5ème Tireur","séries",null,null,"Total","M*","TOTAL","M* TT"]
[]
[1,{"$f":"VLOOKUP(A7,saisie!B$7:AL$26,2,0)","v":"ROCHEFORT   T.S.R"},{"$f":"VLOOKUP(A7,saisie!B$7:AL$26,3,0)","v":1717160},{"$f":"VLOOKUP(A7,saisie!B$7:AL$26,4,0)","v":"BAUDET Philippe"},{"$f":"VLOOKUP(A7,saisie!B$7:AL$26,5,0)","v":89},{"$f":"VLOOKUP(A7,saisie!B$7:AL$26,6,0)","v":90},{"$f":"VLOOKUP(A7,saisie!B$7:AL$26,7,0)","v":88},{"$f":"VLOOKUP(A7,saisie!B$7:AL$26,8,0)","v":267},{"$f":"VLOOKUP(A7,saisie!B$7:AL$26,9,0)","v":0},{"$f":"VLOOKUP(A7,saisie!B$7:AL$26,10,0)","v":"BERGOGNE Cyril"},{"$f":"VLOOKUP(A7,saisie!B$7:AL$26,11,0)","v":95},{"$f":"VLOOKUP(A7,saisie!B$7:AL$26,12,0)","v":91},{"$f":"VLOOKUP(A7,saisie!B$7:AL$26,13,0)","v":95},{"$f":"VLOOKUP(A7,saisie!B$7:AL$26,14,0)","v":281},{"$f":"VLOOKUP(A7,saisie!B$7:AL$26,15,0)","v":0},{"$f":"VLOOKUP(A7,saisie!B$7:AL$26,16,0)","v":"MERCIER Rémy"},{"$f":"VLOOKUP(A7,saisie!B$7:AL$26,17,0)","v":87},{"$f":"VLOOKUP(A7,saisie!B$7:AL$26,18,0)","v":88},{"$f":"VLOOKUP(A7,saisie!B$7:AL$26,19,0)","v":86},{"$f":"VLOOKUP(A7,saisie!B$7:AL$26,20,0)","v":261},{"$f":"VLOOKUP(A7,saisie!B$7:AL$26,21,0)","v":0},{"$f":"VLOOKUP(A7,saisie!B$7:AL$26,22,0)","v":"BRIAND Ptrick"},{"$f":"VLOOKUP(A7,saisie!B$7:AL$26,23,0)","v":83},{"$f":"VLOOKUP(A7,saisie!B$7:AL$26,24,0)","v":74},{"$f":"VLOOKUP(A7,saisie!B$7:AL$26,25,0)","v":77},{"$f":"VLOOKUP(A7,saisie!B$7:AL$26,26,0)","v":234},{"$f":"VLOOKUP(A7,saisie!B$7:AL$26,27,0)","v":0},{"$f":"VLOOKUP(A7,saisie!B$7:AL$26,28,0)","v":"MERCIER Mickael"},{"$f":"VLOOKUP(A7,saisie!B$7:AL$26,29,0)","v":88},{"$f":"VLOOKUP(A7,saisie!B$7:AL$26,30,0)","v":90},{"$f":"VLOOKUP(A7,saisie!B$7:AL$26,31,0)","v":91},{"$f":"VLOOKUP(A7,saisie!B$7:AL$26,32,0)","v":269},{"$f":"VLOOKUP(A7,saisie!B$7:AL$26,33,0)","v":0},{"$f":"VLOOKUP(A7,saisie!B$7:AL$26,34,0)","v":1312},{"$f":"VLOOKUP(A7,saisie!B$7:AL$26,35,0)","v":0}]
[{"$f":"IF(INFO!B8>1,2,\"\")","v":2},{"$f":"VLOOKUP(A8,saisie!B$7:AL$26,2,0)","v":"PONS   A.P.T.S"},{"$f":"VLOOKUP(A8,saisie!B$7:AL$26,3,0)","v":1717100},{"$f":"VLOOKUP(A8,saisie!B$7:AL$26,4,0)","v":"DEBAIN Nathalie"},{"$f":"VLOOKUP(A8,saisie!B$7:AL$26,5,0)","v":80},{"$f":"VLOOKUP(A8,saisie!B$7:AL$26,6,0)","v":82},{"$f":"VLOOKUP(A8,saisie!B$7:AL$26,7,0)","v":75},{"$f":"VLOOKUP(A8,saisie!B$7:AL$26,8,0)","v":237},{"$f":"VLOOKUP(A8,saisie!B$7:AL$26,9,0)","v":0},{"$f":"VLOOKUP(A8,saisie!B$7:AL$26,10,0)","v":"ROUSSEAU Valérie"},{"$f":"VLOOKUP(A8,saisie!B$7:AL$26,11,0)","v":83},{"$f":"VLOOKUP(A8,saisie!B$7:AL$26,12,0)","v":82},{"$f":"VLOOKUP(A8,saisie!B$7:AL$26,13,0)","v":92},{"$f":"VLOOKUP(A8,saisie!B$7:AL$26,14,0)","v":257},{"$f":"VLOOKUP(A8,saisie!B$7:AL$26,15,0)","v":0},{"$f":"VLOOKUP(A8,saisie!B$7:AL$26,16,0)","v":"ROUSSEAU Thierry"},{"$f":"VLOOKUP(A8,saisie!B$7:AL$26,17,0)","v":87},{"$f":"VLOOKUP(A8,saisie!B$7:AL$26,18,0)","v":83},{"$f":"VLOOKUP(A8,saisie!B$7:AL$26,19,0)","v":85},{"$f":"VLOOKUP(A8,saisie!B$7:AL$26,20,0)","v":255},{"$f":"VLOOKUP(A8,saisie!B$7:AL$26,21,0)","v":0},{"$f":"VLOOKUP(A8,saisie!B$7:AL$26,22,0)","v":"POULLY Pascal"},{"$f":"VLOOKUP(A8,saisie!B$7:AL$26,23,0)","v":84},{"$f":"VLOOKUP(A8,saisie!B$7:AL$26,24,0)","v":86},{"$f":"VLOOKUP(A8,saisie!B$7:AL$26,25,0)","v":89},{"$f":"VLOOKUP(A8,saisie!B$7:AL$26,26,0)","v":259},{"$f":"VLOOKUP(A8,saisie!B$7:AL$26,27,0)","v":0},{"$f":"VLOOKUP(A8,saisie!B$7:AL$26,28,0)","v":"BERNARD Kevin"},{"$f":"VLOOKUP(A8,saisie!B$7:AL$26,29,0)","v":89},{"$f":"VLOOKUP(A8,saisie!B$7:AL$26,30,0)","v":90},{"$f":"VLOOKUP(A8,saisie!B$7:AL$26,31,0)","v":91},{"$f":"VLOOKUP(A8,saisie!B$7:AL$26,32,0)","v":270},{"$f":"VLOOKUP(A8,saisie!B$7:AL$26,33,0)","v":0},{"$f":"VLOOKUP(A8,saisie!B$7:AL$26,34,0)","v":1278},{"$f":"VLOOKUP(A8,saisie!B$7:AL$26,35,0)","v":0}]
[{"$f":"IF(INFO!B8>2,3,\"\")","v":3},{"$f":"VLOOKUP(A9,saisie!B$7:AL$26,2,0)","v":"JONZAC   S.J.T"},{"$f":"VLOOKUP(A9,saisie!B$7:AL$26,3,0)","v":1717165},{"$f":"VLOOKUP(A9,saisie!B$7:AL$26,4,0)","v":"GIOVANNONE Philippe"},{"$f":"VLOOKUP(A9,saisie!B$7:AL$26,5,0)","v":84},{"$f":"VLOOKUP(A9,saisie!B$7:AL$26,6,0)","v":80},{"$f":"VLOOKUP(A9,saisie!B$7:AL$26,7,0)","v":83},{"$f":"VLOOKUP(A9,saisie!B$7:AL$26,8,0)","v":247},{"$f":"VLOOKUP(A9,saisie!B$7:AL$26,9,0)","v":0},{"$f":"VLOOKUP(A9,saisie!B$7:AL$26,10,0)","v":"SOURIS Christine"},{"$f":"VLOOKUP(A9,saisie!B$7:AL$26,11,0)","v":81},{"$f":"VLOOKUP(A9,saisie!B$7:AL$26,12,0)","v":75},{"$f":"VLOOKUP(A9,saisie!B$7:AL$26,13,0)","v":81},{"$f":"VLOOKUP(A9,saisie!B$7:AL$26,14,0)","v":237},{"$f":"VLOOKUP(A9,saisie!B$7:AL$26,15,0)","v":0},{"$f":"VLOOKUP(A9,saisie!B$7:AL$26,16,0)","v":"ACHTOUK Kenza"},{"$f":"VLOOKUP(A9,saisie!B$7:AL$26,17,0)","v":92},{"$f":"VLOOKUP(A9,saisie!B$7:AL$26,18,0)","v":92},{"$f":"VLOOKUP(A9,saisie!B$7:AL$26,19,0)","v":88},{"$f":"VLOOKUP(A9,saisie!B$7:AL$26,20,0)","v":272},{"$f":"VLOOKUP(A9,saisie!B$7:AL$26,21,0)","v":0},{"$f":"VLOOKUP(A9,saisie!B$7:AL$26,22,0)","v":"ARRIGONI Stéphane"},{"$f":"VLOOKUP(A9,saisie!B$7:AL$26,23,0)","v":80},{"$f":"VLOOKUP(A9,saisie!B$7:AL$26,24,0)","v":81},{"$f":"VLOOKUP(A9,saisie!B$7:AL$26,25,0)","v":89},{"$f":"VLOOKUP(A9,saisie!B$7:AL$26,26,0)","v":250},{"$f":"VLOOKUP(A9,saisie!B$7:AL$26,27,0)","v":0},{"$f":"VLOOKUP(A9,saisie!B$7:AL$26,28,0)","v":"CORMELIER Hervé"},{"$f":"VLOOKUP(A9,saisie!B$7:AL$26,29,0)","v":91},{"$f":"VLOOKUP(A9,saisie!B$7:AL$26,30,0)","v":88},{"$f":"VLOOKUP(A9,saisie!B$7:AL$26,31,0)","v":83},{"$f":"VLOOKUP(A9,saisie!B$7:AL$26,32,0)","v":262},{"$f":"VLOOKUP(A9,saisie!B$7:AL$26,33,0)","v":0},{"$f":"VLOOKUP(A9,saisie!B$7:AL$26,34,0)","v":1268},{"$f":"VLOOKUP(A9,saisie!B$7:AL$26,35,0)","v":0}]
[{"$f":"IF(INFO!B8>3,4,\"\")","v":4},{"$f":"VLOOKUP(A10,saisie!B$7:AL$26,2,0)","v":"SAINTES S.S.T"},{"$f":"VLOOKUP(A10,saisie!B$7:AL$26,3,0)","v":1717031},{"$f":"VLOOKUP(A10,saisie!B$7:AL$26,4,0)","v":"JACQUES Christophe"},{"$f":"VLOOKUP(A10,saisie!B$7:AL$26,5,0)","v":89},{"$f":"VLOOKUP(A10,saisie!B$7:AL$26,6,0)","v":88},{"$f":"VLOOKUP(A10,saisie!B$7:AL$26,7,0)","v":88},{"$f":"VLOOKUP(A10,saisie!B$7:AL$26,8,0)","v":265},{"$f":"VLOOKUP(A10,saisie!B$7:AL$26,9,0)","v":0},{"$f":"VLOOKUP(A10,saisie!B$7:AL$26,10,0)","v":"RABAT Catherine"},{"$f":"VLOOKUP(A10,saisie!B$7:AL$26,11,0)","v":52},{"$f":"VLOOKUP(A10,saisie!B$7:AL$26,12,0)","v":46},{"$f":"VLOOKUP(A10,saisie!B$7:AL$26,13,0)","v":33},{"$f":"VLOOKUP(A10,saisie!B$7:AL$26,14,0)","v":131},{"$f":"VLOOKUP(A10,saisie!B$7:AL$26,15,0)","v":0},{"$f":"VLOOKUP(A10,saisie!B$7:AL$26,16,0)","v":"SOULIER Jean"},{"$f":"VLOOKUP(A10,saisie!B$7:AL$26,17,0)","v":81},{"$f":"VLOOKUP(A10,saisie!B$7:AL$26,18,0)","v":84},{"$f":"VLOOKUP(A10,saisie!B$7:AL$26,19,0)","v":83},{"$f":"VLOOKUP(A10,saisie!B$7:AL$26,20,0)","v":248},{"$f":"VLOOKUP(A10,saisie!B$7:AL$26,21,0)","v":0},{"$f":"VLOOKUP(A10,saisie!B$7:AL$26,22,0)","v":"BOIN Bertrand"},{"$f":"VLOOKUP(A10,saisie!B$7:AL$26,23,0)","v":71},{"$f":"VLOOKUP(A10,saisie!B$7:AL$26,24,0)","v":75},{"$f":"VLOOKUP(A10,saisie!B$7:AL$26,25,0)","v":79},{"$f":"VLOOKUP(A10,saisie!B$7:AL$26,26,0)","v":225},{"$f":"VLOOKUP(A10,saisie!B$7:AL$26,27,0)","v":0},{"$f":"VLOOKUP(A10,saisie!B$7:AL$26,28,0)","v":"FLEURET Eric"},{"$f":"VLOOKUP(A10,saisie!B$7:AL$26,29,0)","v":92},{"$f":"VLOOKUP(A10,saisie!B$7:AL$26,30,0)","v":90},{"$f":"VLOOKUP(A10,saisie!B$7:AL$26,31,0)","v":91},{"$f":"VLOOKUP(A10,saisie!B$7:AL$26,32,0)","v":273},{"$f":"VLOOKUP(A10,saisie!B$7:AL$26,33,0)","v":0},{"$f":"VLOOKUP(A10,saisie!B$7:AL$26,34,0)","v":1142},{"$f":"VLOOKUP(A10,saisie!B$7:AL$26,35,0)","v":0}]
[{"$f":"IF(INFO!B8>4,5,\"\")","v":""},{"$f":"VLOOKUP(A11,saisie!B$7:AL$26,2,0)","v":{"$error":"#N/A"}},{"$f":"VLOOKUP(A11,saisie!B$7:AL$26,3,0)","v":{"$error":"#N/A"}},{"$f":"VLOOKUP(A11,saisie!B$7:AL$26,4,0)","v":{"$error":"#N/A"}},{"$f":"VLOOKUP(A11,saisie!B$7:AL$26,5,0)","v":{"$error":"#N/A"}},{"$f":"VLOOKUP(A11,saisie!B$7:AL$26,6,0)","v":{"$error":"#N/A"}},{"$f":"VLOOKUP(A11,saisie!B$7:AL$26,7,0)","v":{"$error":"#N/A"}},{"$f":"VLOOKUP(A11,saisie!B$7:AL$26,8,0)","v":{"$error":"#N/A"}},{"$f":"VLOOKUP(A11,saisie!B$7:AL$26,9,0)","v":{"$error":"#N/A"}},{"$f":"VLOOKUP(A11,saisie!B$7:AL$26,10,0)","v":{"$error":"#N/A"}},{"$f":"VLOOKUP(A11,saisie!B$7:AL$26,11,0)","v":{"$error":"#N/A"}},{"$f":"VLOOKUP(A11,saisie!B$7:AL$26,12,0)","v":{"$error":"#N/A"}},{"$f":"VLOOKUP(A11,saisie!B$7:AL$26,13,0)","v":{"$error":"#N/A"}},{"$f":"VLOOKUP(A11,saisie!B$7:AL$26,14,0)","v":{"$error":"#N/A"}},{"$f":"VLOOKUP(A11,saisie!B$7:AL$26,15,0)","v":{"$error":"#N/A"}},{"$f":"VLOOKUP(A11,saisie!B$7:AL$26,16,0)","v":{"$error":"#N/A"}},{"$f":"VLOOKUP(A11,saisie!B$7:AL$26,17,0)","v":{"$error":"#N/A"}},{"$f":"VLOOKUP(A11,saisie!B$7:AL$26,18,0)","v":{"$error":"#N/A"}},{"$f":"VLOOKUP(A11,saisie!B$7:AL$26,19,0)","v":{"$error":"#N/A"}},{"$f":"VLOOKUP(A11,saisie!B$7:AL$26,20,0)","v":{"$error":"#N/A"}},{"$f":"VLOOKUP(A11,saisie!B$7:AL$26,21,0)","v":{"$error":"#N/A"}},{"$f":"VLOOKUP(A11,saisie!B$7:AL$26,22,0)","v":{"$error":"#N/A"}},{"$f":"VLOOKUP(A11,saisie!B$7:AL$26,23,0)","v":{"$error":"#N/A"}},{"$f":"VLOOKUP(A11,saisie!B$7:AL$26,24,0)","v":{"$error":"#N/A"}},{"$f":"VLOOKUP(A11,saisie!B$7:AL$26,25,0)","v":{"$error":"#N/A"}},{"$f":"VLOOKUP(A11,saisie!B$7:AL$26,26,0)","v":{"$error":"#N/A"}},{"$f":"VLOOKUP(A11,saisie!B$7:AL$26,27,0)","v":{"$error":"#N/A"}},{"$f":"VLOOKUP(A11,saisie!B$7:AL$26,28,0)","v":{"$error":"#N/A"}},{"$f":"VLOOKUP(A11,saisie!B$7:AL$26,29,0)","v":{"$error":"#N/A"}},{"$f":"VLOOKUP(A11,saisie!B$7:AL$26,30,0)","v":{"$error":"#N/A"}},{"$f":"VLOOKUP(A11,saisie!B$7:AL$26,31,0)","v":{"$error":"#N/A"}},{"$f":"VLOOKUP(A11,saisie!B$7:AL$26,32,0)","v":{"$error":"#N/A"}},{"$f":"VLOOKUP(A11,saisie!B$7:AL$26,33,0)","v":{"$error":"#N/A"}},{"$f":"VLOOKUP(A11,saisie!B$7:AL$26,34,0)","v":{"$error":"#N/A"}},{"$f":"VLOOKUP(A11,saisie!B$7:AL$26,35,0)","v":{"$error":"#N/A"}}]
[{"$f":"IF(INFO!B8>5,6,\"\")","v":""},{"$f":"VLOOKUP(A12,saisie!B$7:AL$26,2,0)","v":{"$error":"#N/A"}},{"$f":"VLOOKUP(A12,saisie!B$7:AL$26,3,0)","v":{"$error":"#N/A"}},{"$f":"VLOOKUP(A12,saisie!B$7:AL$26,4,0)","v":{"$error":"#N/A"}},{"$f":"VLOOKUP(A12,saisie!B$7:AL$26,5,0)","v":{"$error":"#N/A"}},{"$f":"VLOOKUP(A12,saisie!B$7:AL$26,6,0)","v":{"$error":"#N/A"}},{"$f":"VLOOKUP(A12,saisie!B$7:AL$26,7,0)","v":{"$error":"#N/A"}},{"$f":"VLOOKUP(A12,saisie!B$7:AL$26,8,0)","v":{"$error":"#N/A"}},{"$f":"VLOOKUP(A12,saisie!B$7:AL$26,9,0)","v":{"$error":"#N/A"}},{"$f":"VLOOKUP(A12,saisie!B$7:AL$26,10,0)","v":{"$error":"#N/A"}},{"$f":"VLOOKUP(A12,saisie!B$7:AL$26,11,0)","v":{"$error":"#N/A"}},{"$f":"VLOOKUP(A12,saisie!B$7:AL$26,12,0)","v":{"$error":"#N/A"}},{"$f":"VLOOKUP(A12,saisie!B$7:AL$26,13,0)","v":{"$error":"#N/A"}},{"$f":"VLOOKUP(A12,saisie!B$7:AL$26,14,0)","v":{"$error":"#N/A"}},{"$f":"VLOOKUP(A12,saisie!B$7:AL$26,15,0)","v":{"$error":"#N/A"}},{"$f":"VLOOKUP(A12,saisie!B$7:AL$26,16,0)","v":{"$error":"#N/A"}},{"$f":"VLOOKUP(A12,saisie!B$7:AL$26,17,0)","v":{"$error":"#N/A"}},{"$f":"VLOOKUP(A12,saisie!B$7:AL$26,18,0)","v":{"$error":"#N/A"}},{"$f":"VLOOKUP(A12,saisie!B$7:AL$26,19,0)","v":{"$error":"#N/A"}},{"$f":"VLOOKUP(A12,saisie!B$7:AL$26,20,0)","v":{"$error":"#N/A"}},{"$f":"VLOOKUP(A12,saisie!B$7:AL$26,21,0)","v":{"$error":"#N/A"}},{"$f":"VLOOKUP(A12,saisie!B$7:AL$26,22,0)","v":{"$error":"#N/A"}},{"$f":"VLOOKUP(A12,saisie!B$7:AL$26,23,0)","v":{"$error":"#N/A"}},{"$f":"VLOOKUP(A12,saisie!B$7:AL$26,24,0)","v":{"$error":"#N/A"}},{"$f":"VLOOKUP(A12,saisie!B$7:AL$26,25,0)","v":{"$error":"#N/A"}},{"$f":"VLOOKUP(A12,saisie!B$7:AL$26,26,0)","v":{"$error":"#N/A"}},{"$f":"VLOOKUP(A12,saisie!B$7:AL$26,27,0)","v":{"$error":"#N/A"}},{"$f":"VLOOKUP(A12,saisie!B$7:AL$26,28,0)","v":{"$error":"#N/A"}},{"$f":"VLOOKUP(A12,saisie!B$7:AL$26,29,0)","v":{"$error":"#N/A"}},{"$f":"VLOOKUP(A12,saisie!B$7:AL$26,30,0)","v":{"$error":"#N/A"}},{"$f":"VLOOKUP(A12,saisie!B$7:AL$26,31,0)","v":{"$error":"#N/A"}},{"$f":"VLOOKUP(A12,saisie!B$7:AL$26,32,0)","v":{"$error":"#N/A"}},{"$f":"VLOOKUP(A12,saisie!B$7:AL$26,33,0)","v":{"$error":"#N/A"}},{"$f":"VLOOKUP(A12,saisie!B$7:AL$26,34,0)","v":{"$error":"#N/A"}},{"$f":"VLOOKUP(A12,saisie!B$7:AL$26,35,0)","v":{"$error":"#N/A"}}]
[{"$f":"IF(INFO!B8>6,7,\"\")","v":""},{"$f":"VLOOKUP(A13,saisie!B$7:AL$26,2,0)","v":{"$error":"#N/A"}},{"$f":"VLOOKUP(A13,saisie!B$7:AL$26,3,0)","v":{"$error":"#N/A"}},{"$f":"VLOOKUP(A13,saisie!B$7:AL$26,4,0)","v":{"$error":"#N/A"}},{"$f":"VLOOKUP(A13,saisie!B$7:AL$26,5,0)","v":{"$error":"#N/A"}},{"$f":"VLOOKUP(A13,saisie!B$7:AL$26,6,0)","v":{"$error":"#N/A"}},{"$f":"VLOOKUP(A13,saisie!B$7:AL$26,7,0)","v":{"$error":"#N/A"}},{"$f":"VLOOKUP(A13,saisie!B$7:AL$26,8,0)","v":{"$error":"#N/A"}},{"$f":"VLOOKUP(A13,saisie!B$7:AL$26,9,0)","v":{"$error":"#N/A"}},{"$f":"VLOOKUP(A13,saisie!B$7:AL$26,10,0)","v":{"$error":"#N/A"}},{"$f":"VLOOKUP(A13,saisie!B$7:AL$26,11,0)","v":{"$error":"#N/A"}},{"$f":"VLOOKUP(A13,saisie!B$7:AL$26,12,0)","v":{"$error":"#N/A"}},{"$f":"VLOOKUP(A13,saisie!B$7:AL$26,13,0)","v":{"$error":"#N/A"}},{"$f":"VLOOKUP(A13,saisie!B$7:AL$26,14,0)","v":{"$error":"#N/A"}},{"$f":"VLOOKUP(A13,saisie!B$7:AL$26,15,0)","v":{"$error":"#N/A"}},{"$f":"VLOOKUP(A13,saisie!B$7:AL$26,16,0)","v":{"$error":"#N/A"}},{"$f":"VLOOKUP(A13,saisie!B$7:AL$26,17,0)","v":{"$error":"#N/A"}},{"$f":"VLOOKUP(A13,saisie!B$7:AL$26,18,0)","v":{"$error":"#N/A"}},{"$f":"VLOOKUP(A13,saisie!B$7:AL$26,19,0)","v":{"$error":"#N/A"}},{"$f":"VLOOKUP(A13,saisie!B$7:AL$26,20,0)","v":{"$error":"#N/A"}},{"$f":"VLOOKUP(A13,saisie!B$7:AL$26,21,0)","v":{"$error":"#N/A"}},{"$f":"VLOOKUP(A13,saisie!B$7:AL$26,22,0)","v":{"$error":"#N/A"}},{"$f":"VLOOKUP(A13,saisie!B$7:AL$26,23,0)","v":{"$error":"#N/A"}},{"$f":"VLOOKUP(A13,saisie!B$7:AL$26,24,0)","v":{"$error":"#N/A"}},{"$f":"VLOOKUP(A13,saisie!B$7:AL$26,25,0)","v":{"$error":"#N/A"}},{"$f":"VLOOKUP(A13,saisie!B$7:AL$26,26,0)","v":{"$error":"#N/A"}},{"$f":"VLOOKUP(A13,saisie!B$7:AL$26,27,0)","v":{"$error":"#N/A"}},{"$f":"VLOOKUP(A13,saisie!B$7:AL$26,28,0)","v":{"$error":"#N/A"}},{"$f":"VLOOKUP(A13,saisie!B$7:AL$26,29,0)","v":{"$error":"#N/A"}},{"$f":"VLOOKUP(A13,saisie!B$7:AL$26,30,0)","v":{"$error":"#N/A"}},{"$f":"VLOOKUP(A13,saisie!B$7:AL$26,31,0)","v":{"$error":"#N/A"}},{"$f":"VLOOKUP(A13,saisie!B$7:AL$26,32,0)","v":{"$error":"#N/A"}},{"$f":"VLOOKUP(A13,saisie!B$7:AL$26,33,0)","v":{"$error":"#N/A"}},{"$f":"VLOOKUP(A13,saisie!B$7:AL$26,34,0)","v":{"$error":"#N/A"}},{"$f":"VLOOKUP(A13,saisie!B$7:AL$26,35,0)","v":{"$error":"#N/A"}}]
[{"$f":"IF(INFO!B8>7,8,\"\")","v":""},{"$f":"VLOOKUP(A14,saisie!B$7:AL$26,2,0)","v":{"$error":"#N/A"}},{"$f":"VLOOKUP(A14,saisie!B$7:AL$26,3,0)","v":{"$error":"#N/A"}},{"$f":"VLOOKUP(A14,saisie!B$7:AL$26,4,0)","v":{"$error":"#N/A"}},{"$f":"VLOOKUP(A14,saisie!B$7:AL$26,5,0)","v":{"$error":"#N/A"}},{"$f":"VLOOKUP(A14,saisie!B$7:AL$26,6,0)","v":{"$error":"#N/A"}},{"$f":"VLOOKUP(A14,saisie!B$7:AL$26,7,0)","v":{"$error":"#N/A"}},{"$f":"VLOOKUP(A14,saisie!B$7:AL$26,8,0)","v":{"$error":"#N/A"}},{"$f":"VLOOKUP(A14,saisie!B$7:AL$26,9,0)","v":{"$error":"#N/A"}},{"$f":"VLOOKUP(A14,saisie!B$7:AL$26,10,0)","v":{"$error":"#N/A"}},{"$f":"VLOOKUP(A14,saisie!B$7:AL$26,11,0)","v":{"$error":"#N/A"}},{"$f":"VLOOKUP(A14,saisie!B$7:AL$26,12,0)","v":{"$error":"#N/A"}},{"$f":"VLOOKUP(A14,saisie!B$7:AL$26,13,0)","v":{"$error":"#N/A"}},{"$f":"VLOOKUP(A14,saisie!B$7:AL$26,14,0)","v":{"$error":"#N/A"}},{"$f":"VLOOKUP(A14,saisie!B$7:AL$26,15,0)","v":{"$error":"#N/A"}},{"$f":"VLOOKUP(A14,saisie!B$7:AL$26,16,0)","v":{"$error":"#N/A"}},{"$f":"VLOOKUP(A14,saisie!B$7:AL$26,17,0)","v":{"$error":"#N/A"}},{"$f":"VLOOKUP(A14,saisie!B$7:AL$26,18,0)","v":{"$error":"#N/A"}},{"$f":"VLOOKUP(A14,saisie!B$7:AL$26,19,0)","v":{"$error":"#N/A"}},{"$f":"VLOOKUP(A14,saisie!B$7:AL$26,20,0)","v":{"$error":"#N/A"}},{"$f":"VLOOKUP(A14,saisie!B$7:AL$26,21,0)","v":{"$error":"#N/A"}},{"$f":"VLOOKUP(A14,saisie!B$7:AL$26,22,0)","v":{"$error":"#N/A"}},{"$f":"VLOOKUP(A14,saisie!B$7:AL$26,23,0)","v":{"$error":"#N/A"}},{"$f":"VLOOKUP(A14,saisie!B$7:AL$26,24,0)","v":{"$error":"#N/A"}},{"$f":"VLOOKUP(A14,saisie!B$7:AL$26,25,0)","v":{"$error":"#N/A"}},{"$f":"VLOOKUP(A14,saisie!B$7:AL$26,26,0)","v":{"$error":"#N/A"}},{"$f":"VLOOKUP(A14,saisie!B$7:AL$26,27,0)","v":{"$error":"#N/A"}},{"$f":"VLOOKUP(A14,saisie!B$7:AL$26,28,0)","v":{"$error":"#N/A"}},{"$f":"VLOOKUP(A14,saisie!B$7:AL$26,29,0)","v":{"$error":"#N/A"}},{"$f":"VLOOKUP(A14,saisie!B$7:AL$26,30,0)","v":{"$error":"#N/A"}},{"$f":"VLOOKUP(A14,saisie!B$7:AL$26,31,0)","v":{"$error":"#N/A"}},{"$f":"VLOOKUP(A14,saisie!B$7:AL$26,32,0)","v":{"$error":"#N/A"}},{"$f":"VLOOKUP(A14,saisie!B$7:AL$26,33,0)","v":{"$error":"#N/A"}},{"$f":"VLOOKUP(A14,saisie!B$7:AL$26,34,0)","v":{"$error":"#N/A"}},{"$f":"VLOOKUP(A14,saisie!B$7:AL$26,35,0)","v":{"$error":"#N/A"}}]
[{"$f":"IF(INFO!B8>8,9,\"\")","v":""},{"$f":"VLOOKUP(A15,saisie!B$7:AL$26,2,0)","v":{"$error":"#N/A"}},{"$f":"VLOOKUP(A15,saisie!B$7:AL$26,3,0)","v":{"$error":"#N/A"}},{"$f":"VLOOKUP(A15,saisie!B$7:AL$26,4,0)","v":{"$error":"#N/A"}},{"$f":"VLOOKUP(A15,saisie!B$7:AL$26,5,0)","v":{"$error":"#N/A"}},{"$f":"VLOOKUP(A15,saisie!B$7:AL$26,6,0)","v":{"$error":"#N/A"}},{"$f":"VLOOKUP(A15,saisie!B$7:AL$26,7,0)","v":{"$error":"#N/A"}},{"$f":"VLOOKUP(A15,saisie!B$7:AL$26,8,0)","v":{"$error":"#N/A"}},{"$f":"VLOOKUP(A15,saisie!B$7:AL$26,9,0)","v":{"$error":"#N/A"}},{"$f":"VLOOKUP(A15,saisie!B$7:AL$26,10,0)","v":{"$error":"#N/A"}},{"$f":"VLOOKUP(A15,saisie!B$7:AL$26,11,0)","v":{"$error":"#N/A"}},{"$f":"VLOOKUP(A15,saisie!B$7:AL$26,12,0)","v":{"$error":"#N/A"}},{"$f":"VLOOKUP(A15,saisie!B$7:AL$26,13,0)","v":{"$error":"#N/A"}},{"$f":"VLOOKUP(A15,saisie!B$7:AL$26,14,0)","v":{"$error":"#N/A"}},{"$f":"VLOOKUP(A15,saisie!B$7:AL$26,15,0)","v":{"$error":"#N/A"}},{"$f":"VLOOKUP(A15,saisie!B$7:AL$26,16,0)","v":{"$error":"#N/A"}},{"$f":"VLOOKUP(A15,saisie!B$7:AL$26,17,0)","v":{"$error":"#N/A"}},{"$f":"VLOOKUP(A15,saisie!B$7:AL$26,18,0)","v":{"$error":"#N/A"}},{"$f":"VLOOKUP(A15,saisie!B$7:AL$26,19,0)","v":{"$error":"#N/A"}},{"$f":"VLOOKUP(A15,saisie!B$7:AL$26,20,0)","v":{"$error":"#N/A"}},{"$f":"VLOOKUP(A15,saisie!B$7:AL$26,21,0)","v":{"$error":"#N/A"}},{"$f":"VLOOKUP(A15,saisie!B$7:AL$26,22,0)","v":{"$error":"#N/A"}},{"$f":"VLOOKUP(A15,saisie!B$7:AL$26,23,0)","v":{"$error":"#N/A"}},{"$f":"VLOOKUP(A15,saisie!B$7:AL$26,24,0)","v":{"$error":"#N/A"}},{"$f":"VLOOKUP(A15,saisie!B$7:AL$26,25,0)","v":{"$error":"#N/A"}},{"$f":"VLOOKUP(A15,saisie!B$7:AL$26,26,0)","v":{"$error":"#N/A"}},{"$f":"VLOOKUP(A15,saisie!B$7:AL$26,27,0)","v":{"$error":"#N/A"}},{"$f":"VLOOKUP(A15,saisie!B$7:AL$26,28,0)","v":{"$error":"#N/A"}},{"$f":"VLOOKUP(A15,saisie!B$7:AL$26,29,0)","v":{"$error":"#N/A"}},{"$f":"VLOOKUP(A15,saisie!B$7:AL$26,30,0)","v":{"$error":"#N/A"}},{"$f":"VLOOKUP(A15,saisie!B$7:AL$26,31,0)","v":{"$error":"#N/A"}},{"$f":"VLOOKUP(A15,saisie!B$7:AL$26,32,0)","v":{"$error":"#N/A"}},{"$f":"VLOOKUP(A15,saisie!B$7:AL$26,33,0)","v":{"$error":"#N/A"}},{"$f":"VLOOKUP(A15,saisie!B$7:AL$26,34,0)","v":{"$error":"#N/A"}},{"$f":"VLOOKUP(A15,saisie!B$7:AL$26,35,0)","v":{"$error":"#N/A"}}]
[{"$f":"IF(INFO!B8>9,10,\"\")","v":""},{"$f":"VLOOKUP(A16,saisie!B$7:AL$26,2,0)","v":{"$error":"#N/A"}},{"$f":"VLOOKUP(A16,saisie!B$7:AL$26,3,0)","v":{"$error":"#N/A"}},{"$f":"VLOOKUP(A16,saisie!B$7:AL$26,4,0)","v":{"$error":"#N/A"}},{"$f":"VLOOKUP(A16,saisie!B$7:AL$26,5,0)","v":{"$error":"#N/A"}},{"$f":"VLOOKUP(A16,saisie!B$7:AL$26,6,0)","v":{"$error":"#N/A"}},{"$f":"VLOOKUP(A16,saisie!B$7:AL$26,7,0)","v":{"$error":"#N/A"}},{"$f":"VLOOKUP(A16,saisie!B$7:AL$26,8,0)","v":{"$error":"#N/A"}},{"$f":"VLOOKUP(A16,saisie!B$7:AL$26,9,0)","v":{"$error":"#N/A"}},{"$f":"VLOOKUP(A16,saisie!B$7:AL$26,10,0)","v":{"$error":"#N/A"}},{"$f":"VLOOKUP(A16,saisie!B$7:AL$26,11,0)","v":{"$error":"#N/A"}},{"$f":"VLOOKUP(A16,saisie!B$7:AL$26,12,0)","v":{"$error":"#N/A"}},{"$f":"VLOOKUP(A16,saisie!B$7:AL$26,13,0)","v":{"$error":"#N/A"}},{"$f":"VLOOKUP(A16,saisie!B$7:AL$26,14,0)","v":{"$error":"#N/A"}},{"$f":"VLOOKUP(A16,saisie!B$7:AL$26,15,0)","v":{"$error":"#N/A"}},{"$f":"VLOOKUP(A16,saisie!B$7:AL$26,16,0)","v":{"$error":"#N/A"}},{"$f":"VLOOKUP(A16,saisie!B$7:AL$26,17,0)","v":{"$error":"#N/A"}},{"$f":"VLOOKUP(A16,saisie!B$7:AL$26,18,0)","v":{"$error":"#N/A"}},{"$f":"VLOOKUP(A16,saisie!B$7:AL$26,19,0)","v":{"$error":"#N/A"}},{"$f":"VLOOKUP(A16,saisie!B$7:AL$26,20,0)","v":{"$error":"#N/A"}},{"$f":"VLOOKUP(A16,saisie!B$7:AL$26,21,0)","v":{"$error":"#N/A"}},{"$f":"VLOOKUP(A16,saisie!B$7:AL$26,22,0)","v":{"$error":"#N/A"}},{"$f":"VLOOKUP(A16,saisie!B$7:AL$26,23,0)","v":{"$error":"#N/A"}},{"$f":"VLOOKUP(A16,saisie!B$7:AL$26,24,0)","v":{"$error":"#N/A"}},{"$f":"VLOOKUP(A16,saisie!B$7:AL$26,25,0)","v":{"$error":"#N/A"}},{"$f":"VLOOKUP(A16,saisie!B$7:AL$26,26,0)","v":{"$error":"#N/A"}},{"$f":"VLOOKUP(A16,saisie!B$7:AL$26,27,0)","v":{"$error":"#N/A"}},{"$f":"VLOOKUP(A16,saisie!B$7:AL$26,28,0)","v":{"$error":"#N/A"}},{"$f":"VLOOKUP(A16,saisie!B$7:AL$26,29,0)","v":{"$error":"#N/A"}},{"$f":"VLOOKUP(A16,saisie!B$7:AL$26,30,0)","v":{"$error":"#N/A"}},{"$f":"VLOOKUP(A16,saisie!B$7:AL$26,31,0)","v":{"$error":"#N/A"}},{"$f":"VLOOKUP(A16,saisie!B$7:AL$26,32,0)","v":{"$error":"#N/A"}},{"$f":"VLOOKUP(A16,saisie!B$7:AL$26,33,0)","v":{"$error":"#N/A"}},{"$f":"VLOOKUP(A16,saisie!B$7:AL$26,34,0)","v":{"$error":"#N/A"}},{"$f":"VLOOKUP(A16,saisie!B$7:AL$26,35,0)","v":{"$error":"#N/A"}}]
[{"$f":"IF(INFO!B8>10,11,\"\")","v":""},{"$f":"VLOOKUP(A17,saisie!B$7:AL$26,2,0)","v":{"$error":"#N/A"}},{"$f":"VLOOKUP(A17,saisie!B$7:AL$26,3,0)","v":{"$error":"#N/A"}},{"$f":"VLOOKUP(A17,saisie!B$7:AL$26,4,0)","v":{"$error":"#N/A"}},{"$f":"VLOOKUP(A17,saisie!B$7:AL$26,5,0)","v":{"$error":"#N/A"}},{"$f":"VLOOKUP(A17,saisie!B$7:AL$26,6,0)","v":{"$error":"#N/A"}},{"$f":"VLOOKUP(A17,saisie!B$7:AL$26,7,0)","v":{"$error":"#N/A"}},{"$f":"VLOOKUP(A17,saisie!B$7:AL$26,8,0)","v":{"$error":"#N/A"}},{"$f":"VLOOKUP(A17,saisie!B$7:AL$26,9,0)","v":{"$error":"#N/A"}},{"$f":"VLOOKUP(A17,saisie!B$7:AL$26,10,0)","v":{"$error":"#N/A"}},{"$f":"VLOOKUP(A17,saisie!B$7:AL$26,11,0)","v":{"$error":"#N/A"}},{"$f":"VLOOKUP(A17,saisie!B$7:AL$26,12,0)","v":{"$error":"#N/A"}},{"$f":"VLOOKUP(A17,saisie!B$7:AL$26,13,0)","v":{"$error":"#N/A"}},{"$f":"VLOOKUP(A17,saisie!B$7:AL$26,14,0)","v":{"$error":"#N/A"}},{"$f":"VLOOKUP(A17,saisie!B$7:AL$26,15,0)","v":{"$error":"#N/A"}},{"$f":"VLOOKUP(A17,saisie!B$7:AL$26,16,0)","v":{"$error":"#N/A"}},{"$f":"VLOOKUP(A17,saisie!B$7:AL$26,17,0)","v":{"$error":"#N/A"}},{"$f":"VLOOKUP(A17,saisie!B$7:AL$26,18,0)","v":{"$error":"#N/A"}},{"$f":"VLOOKUP(A17,saisie!B$7:AL$26,19,0)","v":{"$error":"#N/A"}},{"$f":"VLOOKUP(A17,saisie!B$7:AL$26,20,0)","v":{"$error":"#N/A"}},{"$f":"VLOOKUP(A17,saisie!B$7:AL$26,21,0)","v":{"$error":"#N/A"}},{"$f":"VLOOKUP(A17,saisie!B$7:AL$26,22,0)","v":{"$error":"#N/A"}},{"$f":"VLOOKUP(A17,saisie!B$7:AL$26,23,0)","v":{"$error":"#N/A"}},{"$f":"VLOOKUP(A17,saisie!B$7:AL$26,24,0)","v":{"$error":"#N/A"}},{"$f":"VLOOKUP(A17,saisie!B$7:AL$26,25,0)","v":{"$error":"#N/A"}},{"$f":"VLOOKUP(A17,saisie!B$7:AL$26,26,0)","v":{"$error":"#N/A"}},{"$f":"VLOOKUP(A17,saisie!B$7:AL$26,27,0)","v":{"$error":"#N/A"}},{"$f":"VLOOKUP(A17,saisie!B$7:AL$26,28,0)","v":{"$error":"#N/A"}},{"$f":"VLOOKUP(A17,saisie!B$7:AL$26,29,0)","v":{"$error":"#N/A"}},{"$f":"VLOOKUP(A17,saisie!B$7:AL$26,30,0)","v":{"$error":"#N/A"}},{"$f":"VLOOKUP(A17,saisie!B$7:AL$26,31,0)","v":{"$error":"#N/A"}},{"$f":"VLOOKUP(A17,saisie!B$7:AL$26,32,0)","v":{"$error":"#N/A"}},{"$f":"VLOOKUP(A17,saisie!B$7:AL$26,33,0)","v":{"$error":"#N/A"}},{"$f":"VLOOKUP(A17,saisie!B$7:AL$26,34,0)","v":{"$error":"#N/A"}},{"$f":"VLOOKUP(A17,saisie!B$7:AL$26,35,0)","v":{"$error":"#N/A"}}]
[{"$f":"IF(INFO!B8>11,12,\"\")","v":""},{"$f":"VLOOKUP(A18,saisie!B$7:AL$26,2,0)","v":{"$error":"#N/A"}},{"$f":"VLOOKUP(A18,saisie!B$7:AL$26,3,0)","v":{"$error":"#N/A"}},{"$f":"VLOOKUP(A18,saisie!B$7:AL$26,4,0)","v":{"$error":"#N/A"}},{"$f":"VLOOKUP(A18,saisie!B$7:AL$26,5,0)","v":{"$error":"#N/A"}},{"$f":"VLOOKUP(A18,saisie!B$7:AL$26,6,0)","v":{"$error":"#N/A"}},{"$f":"VLOOKUP(A18,saisie!B$7:AL$26,7,0)","v":{"$error":"#N/A"}},{"$f":"VLOOKUP(A18,saisie!B$7:AL$26,8,0)","v":{"$error":"#N/A"}},{"$f":"VLOOKUP(A18,saisie!B$7:AL$26,9,0)","v":{"$error":"#N/A"}},{"$f":"VLOOKUP(A18,saisie!B$7:AL$26,10,0)","v":{"$error":"#N/A"}},{"$f":"VLOOKUP(A18,saisie!B$7:AL$26,11,0)","v":{"$error":"#N/A"}},{"$f":"VLOOKUP(A18,saisie!B$7:AL$26,12,0)","v":{"$error":"#N/A"}},{"$f":"VLOOKUP(A18,saisie!B$7:AL$26,13,0)","v":{"$error":"#N/A"}},{"$f":"VLOOKUP(A18,saisie!B$7:AL$26,14,0)","v":{"$error":"#N/A"}},{"$f":"VLOOKUP(A18,saisie!B$7:AL$26,15,0)","v":{"$error":"#N/A"}},{"$f":"VLOOKUP(A18,saisie!B$7:AL$26,16,0)","v":{"$error":"#N/A"}},{"$f":"VLOOKUP(A18,saisie!B$7:AL$26,17,0)","v":{"$error":"#N/A"}},{"$f":"VLOOKUP(A18,saisie!B$7:AL$26,18,0)","v":{"$error":"#N/A"}},{"$f":"VLOOKUP(A18,saisie!B$7:AL$26,19,0)","v":{"$error":"#N/A"}},{"$f":"VLOOKUP(A18,saisie!B$7:AL$26,20,0)","v":{"$error":"#N/A"}},{"$f":"VLOOKUP(A18,saisie!B$7:AL$26,21,0)","v":{"$error":"#N/A"}},{"$f":"VLOOKUP(A18,saisie!B$7:AL$26,22,0)","v":{"$error":"#N/A"}},{"$f":"VLOOKUP(A18,saisie!B$7:AL$26,23,0)","v":{"$error":"#N/A"}},{"$f":"VLOOKUP(A18,saisie!B$7:AL$26,24,0)","v":{"$error":"#N/A"}},{"$f":"VLOOKUP(A18,saisie!B$7:AL$26,25,0)","v":{"$error":"#N/A"}},{"$f":"VLOOKUP(A18,saisie!B$7:AL$26,26,0)","v":{"$error":"#N/A"}},{"$f":"VLOOKUP(A18,saisie!B$7:AL$26,27,0)","v":{"$error":"#N/A"}},{"$f":"VLOOKUP(A18,saisie!B$7:AL$26,28,0)","v":{"$error":"#N/A"}},{"$f":"VLOOKUP(A18,saisie!B$7:AL$26,29,0)","v":{"$error":"#N/A"}},{"$f":"VLOOKUP(A18,saisie!B$7:AL$26,30,0)","v":{"$error":"#N/A"}},{"$f":"VLOOKUP(A18,saisie!B$7:AL$26,31,0)","v":{"$error":"#N/A"}},{"$f":"VLOOKUP(A18,saisie!B$7:AL$26,32,0)","v":{"$error":"#N/A"}},{"$f":"VLOOKUP(A18,saisie!B$7:AL$26,33,0)","v":{"$error":"#N/A"}},{"$f":"VLOOKUP(A18,saisie!B$7:AL$26,34,0)","v":{"$error":"#N/A"}},{"$f":"VLOOKUP(A18,saisie!B$7:AL$26,35,0)","v":{"$error":"#N/A"}}]
[{"$f":"IF(INFO!B8>12,13,\"\")","v":""},{"$f":"VLOOKUP(A19,saisie!B$7:AL$26,2,0)","v":{"$error":"#N/A"}},{"$f":"VLOOKUP(A19,saisie!B$7:AL$26,3,0)","v":{"$error":"#N/A"}},{"$f":"VLOOKUP(A19,saisie!B$7:AL$26,4,0)","v":{"$error":"#N/A"}},{"$f":"VLOOKUP(A19,saisie!B$7:AL$26,5,0)","v":{"$error":"#N/A"}},{"$f":"VLOOKUP(A19,saisie!B$7:AL$26,6,0)","v":{"$error":"#N/A"}},{"$f":"VLOOKUP(A19,saisie!B$7:AL$26,7,0)","v":{"$error":"#N/A"}},{"$f":"VLOOKUP(A19,saisie!B$7:AL$26,8,0)","v":{"$error":"#N/A"}},{"$f":"VLOOKUP(A19,saisie!B$7:AL$26,9,0)","v":{"$error":"#N/A"}},{"$f":"VLOOKUP(A19,saisie!B$7:AL$26,10,0)","v":{"$error":"#N/A"}},{"$f":"VLOOKUP(A19,saisie!B$7:AL$26,11,0)","v":{"$error":"#N/A"}},{"$f":"VLOOKUP(A19,saisie!B$7:AL$26,12,0)","v":{"$error":"#N/A"}},{"$f":"VLOOKUP(A19,saisie!B$7:AL$26,13,0)","v":{"$error":"#N/A"}},{"$f":"VLOOKUP(A19,saisie!B$7:AL$26,14,0)","v":{"$error":"#N/A"}},{"$f":"VLOOKUP(A19,saisie!B$7:AL$26,15,0)","v":{"$error":"#N/A"}},{"$f":"VLOOKUP(A19,saisie!B$7:AL$26,16,0)","v":{"$error":"#N/A"}},{"$f":"VLOOKUP(A19,saisie!B$7:AL$26,17,0)","v":{"$error":"#N/A"}},{"$f":"VLOOKUP(A19,saisie!B$7:AL$26,18,0)","v":{"$error":"#N/A"}},{"$f":"VLOOKUP(A19,saisie!B$7:AL$26,19,0)","v":{"$error":"#N/A"}},{"$f":"VLOOKUP(A19,saisie!B$7:AL$26,20,0)","v":{"$error":"#N/A"}},{"$f":"VLOOKUP(A19,saisie!B$7:AL$26,21,0)","v":{"$error":"#N/A"}},{"$f":"VLOOKUP(A19,saisie!B$7:AL$26,22,0)","v":{"$error":"#N/A"}},{"$f":"VLOOKUP(A19,saisie!B$7:AL$26,23,0)","v":{"$error":"#N/A"}},{"$f":"VLOOKUP(A19,saisie!B$7:AL$26,24,0)","v":{"$error":"#N/A"}},{"$f":"VLOOKUP(A19,saisie!B$7:AL$26,25,0)","v":{"$error":"#N/A"}},{"$f":"VLOOKUP(A19,saisie!B$7:AL$26,26,0)","v":{"$error":"#N/A"}},{"$f":"VLOOKUP(A19,saisie!B$7:AL$26,27,0)","v":{"$error":"#N/A"}},{"$f":"VLOOKUP(A19,saisie!B$7:AL$26,28,0)","v":{"$error":"#N/A"}},{"$f":"VLOOKUP(A19,saisie!B$7:AL$26,29,0)","v":{"$error":"#N/A"}},{"$f":"VLOOKUP(A19,saisie!B$7:AL$26,30,0)","v":{"$error":"#N/A"}},{"$f":"VLOOKUP(A19,saisie!B$7:AL$26,31,0)","v":{"$error":"#N/A"}},{"$f":"VLOOKUP(A19,saisie!B$7:AL$26,32,0)","v":{"$error":"#N/A"}},{"$f":"VLOOKUP(A19,saisie!B$7:AL$26,33,0)","v":{"$error":"#N/A"}},{"$f":"VLOOKUP(A19,saisie!B$7:AL$26,34,0)","v":{"$error":"#N/A"}},{"$f":"VLOOKUP(A19,saisie!B$7:AL$26,35,0)","v":{"$error":"#N/A"}}]
[{"$f":"IF(INFO!B8>13,14,\"\")","v":""},{"$f":"VLOOKUP(A20,saisie!B$7:AL$26,2,0)","v":{"$error":"#N/A"}},{"$f":"VLOOKUP(A20,saisie!B$7:AL$26,3,0)","v":{"$error":"#N/A"}},{"$f":"VLOOKUP(A20,saisie!B$7:AL$26,4,0)","v":{"$error":"#N/A"}},{"$f":"VLOOKUP(A20,saisie!B$7:AL$26,5,0)","v":{"$error":"#N/A"}},{"$f":"VLOOKUP(A20,saisie!B$7:AL$26,6,0)","v":{"$error":"#N/A"}},{"$f":"VLOOKUP(A20,saisie!B$7:AL$26,7,0)","v":{"$error":"#N/A"}},{"$f":"VLOOKUP(A20,saisie!B$7:AL$26,8,0)","v":{"$error":"#N/A"}},{"$f":"VLOOKUP(A20,saisie!B$7:AL$26,9,0)","v":{"$error":"#N/A"}},{"$f":"VLOOKUP(A20,saisie!B$7:AL$26,10,0)","v":{"$error":"#N/A"}},{"$f":"VLOOKUP(A20,saisie!B$7:AL$26,11,0)","v":{"$error":"#N/A"}},{"$f":"VLOOKUP(A20,saisie!B$7:AL$26,12,0)","v":{"$error":"#N/A"}},{"$f":"VLOOKUP(A20,saisie!B$7:AL$26,13,0)","v":{"$error":"#N/A"}},{"$f":"VLOOKUP(A20,saisie!B$7:AL$26,14,0)","v":{"$error":"#N/A"}},{"$f":"VLOOKUP(A20,saisie!B$7:AL$26,15,0)","v":{"$error":"#N/A"}},{"$f":"VLOOKUP(A20,saisie!B$7:AL$26,16,0)","v":{"$error":"#N/A"}},{"$f":"VLOOKUP(A20,saisie!B$7:AL$26,17,0)","v":{"$error":"#N/A"}},{"$f":"VLOOKUP(A20,saisie!B$7:AL$26,18,0)","v":{"$error":"#N/A"}},{"$f":"VLOOKUP(A20,saisie!B$7:AL$26,19,0)","v":{"$error":"#N/A"}},{"$f":"VLOOKUP(A20,saisie!B$7:AL$26,20,0)","v":{"$error":"#N/A"}},{"$f":"VLOOKUP(A20,saisie!B$7:AL$26,21,0)","v":{"$error":"#N/A"}},{"$f":"VLOOKUP(A20,saisie!B$7:AL$26,22,0)","v":{"$error":"#N/A"}},{"$f":"VLOOKUP(A20,saisie!B$7:AL$26,23,0)","v":{"$error":"#N/A"}},{"$f":"VLOOKUP(A20,saisie!B$7:AL$26,24,0)","v":{"$error":"#N/A"}},{"$f":"VLOOKUP(A20,saisie!B$7:AL$26,25,0)","v":{"$error":"#N/A"}},{"$f":"VLOOKUP(A20,saisie!B$7:AL$26,26,0)","v":{"$error":"#N/A"}},{"$f":"VLOOKUP(A20,saisie!B$7:AL$26,27,0)","v":{"$error":"#N/A"}},{"$f":"VLOOKUP(A20,saisie!B$7:AL$26,28,0)","v":{"$error":"#N/A"}},{"$f":"VLOOKUP(A20,saisie!B$7:AL$26,29,0)","v":{"$error":"#N/A"}},{"$f":"VLOOKUP(A20,saisie!B$7:AL$26,30,0)","v":{"$error":"#N/A"}},{"$f":"VLOOKUP(A20,saisie!B$7:AL$26,31,0)","v":{"$error":"#N/A"}},{"$f":"VLOOKUP(A20,saisie!B$7:AL$26,32,0)","v":{"$error":"#N/A"}},{"$f":"VLOOKUP(A20,saisie!B$7:AL$26,33,0)","v":{"$error":"#N/A"}},{"$f":"VLOOKUP(A20,saisie!B$7:AL$26,34,0)","v":{"$error":"#N/A"}},{"$f":"VLOOKUP(A20,saisie!B$7:AL$26,35,0)","v":{"$error":"#N/A"}}]
[{"$f":"IF(INFO!B8>14,15,\"\")","v":""},{"$f":"VLOOKUP(A21,saisie!B$7:AL$26,2,0)","v":{"$error":"#N/A"}},{"$f":"VLOOKUP(A21,saisie!B$7:AL$26,3,0)","v":{"$error":"#N/A"}},{"$f":"VLOOKUP(A21,saisie!B$7:AL$26,4,0)","v":{"$error":"#N/A"}},{"$f":"VLOOKUP(A21,saisie!B$7:AL$26,5,0)","v":{"$error":"#N/A"}},{"$f":"VLOOKUP(A21,saisie!B$7:AL$26,6,0)","v":{"$error":"#N/A"}},{"$f":"VLOOKUP(A21,saisie!B$7:AL$26,7,0)","v":{"$error":"#N/A"}},{"$f":"VLOOKUP(A21,saisie!B$7:AL$26,8,0)","v":{"$error":"#N/A"}},{"$f":"VLOOKUP(A21,saisie!B$7:AL$26,9,0)","v":{"$error":"#N/A"}},{"$f":"VLOOKUP(A21,saisie!B$7:AL$26,10,0)","v":{"$error":"#N/A"}},{"$f":"VLOOKUP(A21,saisie!B$7:AL$26,11,0)","v":{"$error":"#N/A"}},{"$f":"VLOOKUP(A21,saisie!B$7:AL$26,12,0)","v":{"$error":"#N/A"}},{"$f":"VLOOKUP(A21,saisie!B$7:AL$26,13,0)","v":{"$error":"#N/A"}},{"$f":"VLOOKUP(A21,saisie!B$7:AL$26,14,0)","v":{"$error":"#N/A"}},{"$f":"VLOOKUP(A21,saisie!B$7:AL$26,15,0)","v":{"$error":"#N/A"}},{"$f":"VLOOKUP(A21,saisie!B$7:AL$26,16,0)","v":{"$error":"#N/A"}},{"$f":"VLOOKUP(A21,saisie!B$7:AL$26,17,0)","v":{"$error":"#N/A"}},{"$f":"VLOOKUP(A21,saisie!B$7:AL$26,18,0)","v":{"$error":"#N/A"}},{"$f":"VLOOKUP(A21,saisie!B$7:AL$26,19,0)","v":{"$error":"#N/A"}},{"$f":"VLOOKUP(A21,saisie!B$7:AL$26,20,0)","v":{"$error":"#N/A"}},{"$f":"VLOOKUP(A21,saisie!B$7:AL$26,21,0)","v":{"$error":"#N/A"}},{"$f":"VLOOKUP(A21,saisie!B$7:AL$26,22,0)","v":{"$error":"#N/A"}},{"$f":"VLOOKUP(A21,saisie!B$7:AL$26,23,0)","v":{"$error":"#N/A"}},{"$f":"VLOOKUP(A21,saisie!B$7:AL$26,24,0)","v":{"$error":"#N/A"}},{"$f":"VLOOKUP(A21,saisie!B$7:AL$26,25,0)","v":{"$error":"#N/A"}},{"$f":"VLOOKUP(A21,saisie!B$7:AL$26,26,0)","v":{"$error":"#N/A"}},{"$f":"VLOOKUP(A21,saisie!B$7:AL$26,27,0)","v":{"$error":"#N/A"}},{"$f":"VLOOKUP(A21,saisie!B$7:AL$26,28,0)","v":{"$error":"#N/A"}},{"$f":"VLOOKUP(A21,saisie!B$7:AL$26,29,0)","v":{"$error":"#N/A"}},{"$f":"VLOOKUP(A21,saisie!B$7:AL$26,30,0)","v":{"$error":"#N/A"}},{"$f":"VLOOKUP(A21,saisie!B$7:AL$26,31,0)","v":{"$error":"#N/A"}},{"$f":"VLOOKUP(A21,saisie!B$7:AL$26,32,0)","v":{"$error":"#N/A"}},{"$f":"VLOOKUP(A21,saisie!B$7:AL$26,33,0)","v":{"$error":"#N/A"}},{"$f":"VLOOKUP(A21,saisie!B$7:AL$26,34,0)","v":{"$error":"#N/A"}},{"$f":"VLOOKUP(A21,saisie!B$7:AL$26,35,0)","v":{"$error":"#N/A"}}]
[{"$f":"IF(INFO!B8>15,16,\"\")","v":""},{"$f":"VLOOKUP(A22,saisie!B$7:AL$26,2,0)","v":{"$error":"#N/A"}},{"$f":"VLOOKUP(A22,saisie!B$7:AL$26,3,0)","v":{"$error":"#N/A"}},{"$f":"VLOOKUP(A22,saisie!B$7:AL$26,4,0)","v":{"$error":"#N/A"}},{"$f":"VLOOKUP(A22,saisie!B$7:AL$26,5,0)","v":{"$error":"#N/A"}},{"$f":"VLOOKUP(A22,saisie!B$7:AL$26,6,0)","v":{"$error":"#N/A"}},{"$f":"VLOOKUP(A22,saisie!B$7:AL$26,7,0)","v":{"$error":"#N/A"}},{"$f":"VLOOKUP(A22,saisie!B$7:AL$26,8,0)","v":{"$error":"#N/A"}},{"$f":"VLOOKUP(A22,saisie!B$7:AL$26,9,0)","v":{"$error":"#N/A"}},{"$f":"VLOOKUP(A22,saisie!B$7:AL$26,10,0)","v":{"$error":"#N/A"}},{"$f":"VLOOKUP(A22,saisie!B$7:AL$26,11,0)","v":{"$error":"#N/A"}},{"$f":"VLOOKUP(A22,saisie!B$7:AL$26,12,0)","v":{"$error":"#N/A"}},{"$f":"VLOOKUP(A22,saisie!B$7:AL$26,13,0)","v":{"$error":"#N/A"}},{"$f":"VLOOKUP(A22,saisie!B$7:AL$26,14,0)","v":{"$error":"#N/A"}},{"$f":"VLOOKUP(A22,saisie!B$7:AL$26,15,0)","v":{"$error":"#N/A"}},{"$f":"VLOOKUP(A22,saisie!B$7:AL$26,16,0)","v":{"$error":"#N/A"}},{"$f":"VLOOKUP(A22,saisie!B$7:AL$26,17,0)","v":{"$error":"#N/A"}},{"$f":"VLOOKUP(A22,saisie!B$7:AL$26,18,0)","v":{"$error":"#N/A"}},{"$f":"VLOOKUP(A22,saisie!B$7:AL$26,19,0)","v":{"$error":"#N/A"}},{"$f":"VLOOKUP(A22,saisie!B$7:AL$26,20,0)","v":{"$error":"#N/A"}},{"$f":"VLOOKUP(A22,saisie!B$7:AL$26,21,0)","v":{"$error":"#N/A"}},{"$f":"VLOOKUP(A22,saisie!B$7:AL$26,22,0)","v":{"$error":"#N/A"}},{"$f":"VLOOKUP(A22,saisie!B$7:AL$26,23,0)","v":{"$error":"#N/A"}},{"$f":"VLOOKUP(A22,saisie!B$7:AL$26,24,0)","v":{"$error":"#N/A"}},{"$f":"VLOOKUP(A22,saisie!B$7:AL$26,25,0)","v":{"$error":"#N/A"}},{"$f":"VLOOKUP(A22,saisie!B$7:AL$26,26,0)","v":{"$error":"#N/A"}},{"$f":"VLOOKUP(A22,saisie!B$7:AL$26,27,0)","v":{"$error":"#N/A"}},{"$f":"VLOOKUP(A22,saisie!B$7:AL$26,28,0)","v":{"$error":"#N/A"}},{"$f":"VLOOKUP(A22,saisie!B$7:AL$26,29,0)","v":{"$error":"#N/A"}},{"$f":"VLOOKUP(A22,saisie!B$7:AL$26,30,0)","v":{"$error":"#N/A"}},{"$f":"VLOOKUP(A22,saisie!B$7:AL$26,31,0)","v":{"$error":"#N/A"}},{"$f":"VLOOKUP(A22,saisie!B$7:AL$26,32,0)","v":{"$error":"#N/A"}},{"$f":"VLOOKUP(A22,saisie!B$7:AL$26,33,0)","v":{"$error":"#N/A"}},{"$f":"VLOOKUP(A22,saisie!B$7:AL$26,34,0)","v":{"$error":"#N/A"}},{"$f":"VLOOKUP(A22,saisie!B$7:AL$26,35,0)","v":{"$error":"#N/A"}}]
[{"$f":"IF(INFO!B8>16,17,\"\")","v":""},{"$f":"VLOOKUP(A23,saisie!B$7:AL$26,2,0)","v":{"$error":"#N/A"}},{"$f":"VLOOKUP(A23,saisie!B$7:AL$26,3,0)","v":{"$error":"#N/A"}},{"$f":"VLOOKUP(A23,saisie!B$7:AL$26,4,0)","v":{"$error":"#N/A"}},{"$f":"VLOOKUP(A23,saisie!B$7:AL$26,5,0)","v":{"$error":"#N/A"}},{"$f":"VLOOKUP(A23,saisie!B$7:AL$26,6,0)","v":{"$error":"#N/A"}},{"$f":"VLOOKUP(A23,saisie!B$7:AL$26,7,0)","v":{"$error":"#N/A"}},{"$f":"VLOOKUP(A23,saisie!B$7:AL$26,8,0)","v":{"$error":"#N/A"}},{"$f":"VLOOKUP(A23,saisie!B$7:AL$26,9,0)","v":{"$error":"#N/A"}},{"$f":"VLOOKUP(A23,saisie!B$7:AL$26,10,0)","v":{"$error":"#N/A"}},{"$f":"VLOOKUP(A23,saisie!B$7:AL$26,11,0)","v":{"$error":"#N/A"}},{"$f":"VLOOKUP(A23,saisie!B$7:AL$26,12,0)","v":{"$error":"#N/A"}},{"$f":"VLOOKUP(A23,saisie!B$7:AL$26,13,0)","v":{"$error":"#N/A"}},{"$f":"VLOOKUP(A23,saisie!B$7:AL$26,14,0)","v":{"$error":"#N/A"}},{"$f":"VLOOKUP(A23,saisie!B$7:AL$26,15,0)","v":{"$error":"#N/A"}},{"$f":"VLOOKUP(A23,saisie!B$7:AL$26,16,0)","v":{"$error":"#N/A"}},{"$f":"VLOOKUP(A23,saisie!B$7:AL$26,17,0)","v":{"$error":"#N/A"}},{"$f":"VLOOKUP(A23,saisie!B$7:AL$26,18,0)","v":{"$error":"#N/A"}},{"$f":"VLOOKUP(A23,saisie!B$7:AL$26,19,0)","v":{"$error":"#N/A"}},{"$f":"VLOOKUP(A23,saisie!B$7:AL$26,20,0)","v":{"$error":"#N/A"}},{"$f":"VLOOKUP(A23,saisie!B$7:AL$26,21,0)","v":{"$error":"#N/A"}},{"$f":"VLOOKUP(A23,saisie!B$7:AL$26,22,0)","v":{"$error":"#N/A"}},{"$f":"VLOOKUP(A23,saisie!B$7:AL$26,23,0)","v":{"$error":"#N/A"}},{"$f":"VLOOKUP(A23,saisie!B$7:AL$26,24,0)","v":{"$error":"#N/A"}},{"$f":"VLOOKUP(A23,saisie!B$7:AL$26,25,0)","v":{"$error":"#N/A"}},{"$f":"VLOOKUP(A23,saisie!B$7:AL$26,26,0)","v":{"$error":"#N/A"}},{"$f":"VLOOKUP(A23,saisie!B$7:AL$26,27,0)","v":{"$error":"#N/A"}},{"$f":"VLOOKUP(A23,saisie!B$7:AL$26,28,0)","v":{"$error":"#N/A"}},{"$f":"VLOOKUP(A23,saisie!B$7:AL$26,29,0)","v":{"$error":"#N/A"}},{"$f":"VLOOKUP(A23,saisie!B$7:AL$26,30,0)","v":{"$error":"#N/A"}},{"$f":"VLOOKUP(A23,saisie!B$7:AL$26,31,0)","v":{"$error":"#N/A"}},{"$f":"VLOOKUP(A23,saisie!B$7:AL$26,32,0)","v":{"$error":"#N/A"}},{"$f":"VLOOKUP(A23,saisie!B$7:AL$26,33,0)","v":{"$error":"#N/A"}},{"$f":"VLOOKUP(A23,saisie!B$7:AL$26,34,0)","v":{"$error":"#N/A"}},{"$f":"VLOOKUP(A23,saisie!B$7:AL$26,35,0)","v":{"$error":"#N/A"}}]
[{"$f":"IF(INFO!B8>17,18,\"\")","v":""},{"$f":"VLOOKUP(A24,saisie!B$7:AL$26,2,0)","v":{"$error":"#N/A"}},{"$f":"VLOOKUP(A24,saisie!B$7:AL$26,3,0)","v":{"$error":"#N/A"}},{"$f":"VLOOKUP(A24,saisie!B$7:AL$26,4,0)","v":{"$error":"#N/A"}},{"$f":"VLOOKUP(A24,saisie!B$7:AL$26,5,0)","v":{"$error":"#N/A"}},{"$f":"VLOOKUP(A24,saisie!B$7:AL$26,6,0)","v":{"$error":"#N/A"}},{"$f":"VLOOKUP(A24,saisie!B$7:AL$26,7,0)","v":{"$error":"#N/A"}},{"$f":"VLOOKUP(A24,saisie!B$7:AL$26,8,0)","v":{"$error":"#N/A"}},{"$f":"VLOOKUP(A24,saisie!B$7:AL$26,9,0)","v":{"$error":"#N/A"}},{"$f":"VLOOKUP(A24,saisie!B$7:AL$26,10,0)","v":{"$error":"#N/A"}},{"$f":"VLOOKUP(A24,saisie!B$7:AL$26,11,0)","v":{"$error":"#N/A"}},{"$f":"VLOOKUP(A24,saisie!B$7:AL$26,12,0)","v":{"$error":"#N/A"}},{"$f":"VLOOKUP(A24,saisie!B$7:AL$26,13,0)","v":{"$error":"#N/A"}},{"$f":"VLOOKUP(A24,saisie!B$7:AL$26,14,0)","v":{"$error":"#N/A"}},{"$f":"VLOOKUP(A24,saisie!B$7:AL$26,15,0)","v":{"$error":"#N/A"}},{"$f":"VLOOKUP(A24,saisie!B$7:AL$26,16,0)","v":{"$error":"#N/A"}},{"$f":"VLOOKUP(A24,saisie!B$7:AL$26,17,0)","v":{"$error":"#N/A"}},{"$f":"VLOOKUP(A24,saisie!B$7:AL$26,18,0)","v":{"$error":"#N/A"}},{"$f":"VLOOKUP(A24,saisie!B$7:AL$26,19,0)","v":{"$error":"#N/A"}},{"$f":"VLOOKUP(A24,saisie!B$7:AL$26,20,0)","v":{"$error":"#N/A"}},{"$f":"VLOOKUP(A24,saisie!B$7:AL$26,21,0)","v":{"$error":"#N/A"}},{"$f":"VLOOKUP(A24,saisie!B$7:AL$26,22,0)","v":{"$error":"#N/A"}},{"$f":"VLOOKUP(A24,saisie!B$7:AL$26,23,0)","v":{"$error":"#N/A"}},{"$f":"VLOOKUP(A24,saisie!B$7:AL$26,24,0)","v":{"$error":"#N/A"}},{"$f":"VLOOKUP(A24,saisie!B$7:AL$26,25,0)","v":{"$error":"#N/A"}},{"$f":"VLOOKUP(A24,saisie!B$7:AL$26,26,0)","v":{"$error":"#N/A"}},{"$f":"VLOOKUP(A24,saisie!B$7:AL$26,27,0)","v":{"$error":"#N/A"}},{"$f":"VLOOKUP(A24,saisie!B$7:AL$26,28,0)","v":{"$error":"#N/A"}},{"$f":"VLOOKUP(A24,saisie!B$7:AL$26,29,0)","v":{"$error":"#N/A"}},{"$f":"VLOOKUP(A24,saisie!B$7:AL$26,30,0)","v":{"$error":"#N/A"}},{"$f":"VLOOKUP(A24,saisie!B$7:AL$26,31,0)","v":{"$error":"#N/A"}},{"$f":"VLOOKUP(A24,saisie!B$7:AL$26,32,0)","v":{"$error":"#N/A"}},{"$f":"VLOOKUP(A24,saisie!B$7:AL$26,33,0)","v":{"$error":"#N/A"}},{"$f":"VLOOKUP(A24,saisie!B$7:AL$26,34,0)","v":{"$error":"#N/A"}},{"$f":"VLOOKUP(A24,saisie!B$7:AL$26,35,0)","v":{"$error":"#N/A"}}]
[{"$f":"IF(INFO!B8>18,19,\"\")","v":""},{"$f":"VLOOKUP(A25,saisie!B$7:AL$26,2,0)","v":{"$error":"#N/A"}},{"$f":"VLOOKUP(A25,saisie!B$7:AL$26,3,0)","v":{"$error":"#N/A"}},{"$f":"VLOOKUP(A25,saisie!B$7:AL$26,4,0)","v":{"$error":"#N/A"}},{"$f":"VLOOKUP(A25,saisie!B$7:AL$26,5,0)","v":{"$error":"#N/A"}},{"$f":"VLOOKUP(A25,saisie!B$7:AL$26,6,0)","v":{"$error":"#N/A"}},{"$f":"VLOOKUP(A25,saisie!B$7:AL$26,7,0)","v":{"$error":"#N/A"}},{"$f":"VLOOKUP(A25,saisie!B$7:AL$26,8,0)","v":{"$error":"#N/A"}},{"$f":"VLOOKUP(A25,saisie!B$7:AL$26,9,0)","v":{"$error":"#N/A"}},{"$f":"VLOOKUP(A25,saisie!B$7:AL$26,10,0)","v":{"$error":"#N/A"}},{"$f":"VLOOKUP(A25,saisie!B$7:AL$26,11,0)","v":{"$error":"#N/A"}},{"$f":"VLOOKUP(A25,saisie!B$7:AL$26,12,0)","v":{"$error":"#N/A"}},{"$f":"VLOOKUP(A25,saisie!B$7:AL$26,13,0)","v":{"$error":"#N/A"}},{"$f":"VLOOKUP(A25,saisie!B$7:AL$26,14,0)","v":{"$error":"#N/A"}},{"$f":"VLOOKUP(A25,saisie!B$7:AL$26,15,0)","v":{"$error":"#N/A"}},{"$f":"VLOOKUP(A25,saisie!B$7:AL$26,16,0)","v":{"$error":"#N/A"}},{"$f":"VLOOKUP(A25,saisie!B$7:AL$26,17,0)","v":{"$error":"#N/A"}},{"$f":"VLOOKUP(A25,saisie!B$7:AL$26,18,0)","v":{"$error":"#N/A"}},{"$f":"VLOOKUP(A25,saisie!B$7:AL$26,19,0)","v":{"$error":"#N/A"}},{"$f":"VLOOKUP(A25,saisie!B$7:AL$26,20,0)","v":{"$error":"#N/A"}},{"$f":"VLOOKUP(A25,saisie!B$7:AL$26,21,0)","v":{"$error":"#N/A"}},{"$f":"VLOOKUP(A25,saisie!B$7:AL$26,22,0)","v":{"$error":"#N/A"}},{"$f":"VLOOKUP(A25,saisie!B$7:AL$26,23,0)","v":{"$error":"#N/A"}},{"$f":"VLOOKUP(A25,saisie!B$7:AL$26,24,0)","v":{"$error":"#N/A"}},{"$f":"VLOOKUP(A25,saisie!B$7:AL$26,25,0)","v":{"$error":"#N/A"}},{"$f":"VLOOKUP(A25,saisie!B$7:AL$26,26,0)","v":{"$error":"#N/A"}},{"$f":"VLOOKUP(A25,saisie!B$7:AL$26,27,0)","v":{"$error":"#N/A"}},{"$f":"VLOOKUP(A25,saisie!B$7:AL$26,28,0)","v":{"$error":"#N/A"}},{"$f":"VLOOKUP(A25,saisie!B$7:AL$26,29,0)","v":{"$error":"#N/A"}},{"$f":"VLOOKUP(A25,saisie!B$7:AL$26,30,0)","v":{"$error":"#N/A"}},{"$f":"VLOOKUP(A25,saisie!B$7:AL$26,31,0)","v":{"$error":"#N/A"}},{"$f":"VLOOKUP(A25,saisie!B$7:AL$26,32,0)","v":{"$error":"#N/A"}},{"$f":"VLOOKUP(A25,saisie!B$7:AL$26,33,0)","v":{"$error":"#N/A"}},{"$f":"VLOOKUP(A25,saisie!B$7:AL$26,34,0)","v":{"$error":"#N/A"}},{"$f":"VLOOKUP(A25,saisie!B$7:AL$26,35,0)","v":{"$error":"#N/A"}}]
[{"$f":"IF(INFO!B8>19,20,\"\")","v":""},{"$f":"VLOOKUP(A26,saisie!B$7:AL$26,2,0)","v":{"$error":"#N/A"}},{"$f":"VLOOKUP(A26,saisie!B$7:AL$26,3,0)","v":{"$error":"#N/A"}},{"$f":"VLOOKUP(A26,saisie!B$7:AL$26,4,0)","v":{"$error":"#N/A"}},{"$f":"VLOOKUP(A26,saisie!B$7:AL$26,5,0)","v":{"$error":"#N/A"}},{"$f":"VLOOKUP(A26,saisie!B$7:AL$26,6,0)","v":{"$error":"#N/A"}},{"$f":"VLOOKUP(A26,saisie!B$7:AL$26,7,0)","v":{"$error":"#N/A"}},{"$f":"VLOOKUP(A26,saisie!B$7:AL$26,8,0)","v":{"$error":"#N/A"}},{"$f":"VLOOKUP(A26,saisie!B$7:AL$26,9,0)","v":{"$error":"#N/A"}},{"$f":"VLOOKUP(A26,saisie!B$7:AL$26,10,0)","v":{"$error":"#N/A"}},{"$f":"VLOOKUP(A26,saisie!B$7:AL$26,11,0)","v":{"$error":"#N/A"}},{"$f":"VLOOKUP(A26,saisie!B$7:AL$26,12,0)","v":{"$error":"#N/A"}},{"$f":"VLOOKUP(A26,saisie!B$7:AL$26,13,0)","v":{"$error":"#N/A"}},{"$f":"VLOOKUP(A26,saisie!B$7:AL$26,14,0)","v":{"$error":"#N/A"}},{"$f":"VLOOKUP(A26,saisie!B$7:AL$26,15,0)","v":{"$error":"#N/A"}},{"$f":"VLOOKUP(A26,saisie!B$7:AL$26,16,0)","v":{"$error":"#N/A"}},{"$f":"VLOOKUP(A26,saisie!B$7:AL$26,17,0)","v":{"$error":"#N/A"}},{"$f":"VLOOKUP(A26,saisie!B$7:AL$26,18,0)","v":{"$error":"#N/A"}},{"$f":"VLOOKUP(A26,saisie!B$7:AL$26,19,0)","v":{"$error":"#N/A"}},{"$f":"VLOOKUP(A26,saisie!B$7:AL$26,20,0)","v":{"$error":"#N/A"}},{"$f":"VLOOKUP(A26,saisie!B$7:AL$26,21,0)","v":{"$error":"#N/A"}},{"$f":"VLOOKUP(A26,saisie!B$7:AL$26,22,0)","v":{"$error":"#N/A"}},{"$f":"VLOOKUP(A26,saisie!B$7:AL$26,23,0)","v":{"$error":"#N/A"}},{"$f":"VLOOKUP(A26,saisie!B$7:AL$26,24,0)","v":{"$error":"#N/A"}},{"$f":"VLOOKUP(A26,saisie!B$7:AL$26,25,0)","v":{"$error":"#N/A"}},{"$f":"VLOOKUP(A26,saisie!B$7:AL$26,26,0)","v":{"$error":"#N/A"}},{"$f":"VLOOKUP(A26,saisie!B$7:AL$26,27,0)","v":{"$error":"#N/A"}},{"$f":"VLOOKUP(A26,saisie!B$7:AL$26,28,0)","v":{"$error":"#N/A"}},{"$f":"VLOOKUP(A26,saisie!B$7:AL$26,29,0)","v":{"$error":"#N/A"}},{"$f":"VLOOKUP(A26,saisie!B$7:AL$26,30,0)","v":{"$error":"#N/A"}},{"$f":"VLOOKUP(A26,saisie!B$7:AL$26,31,0)","v":{"$error":"#N/A"}},{"$f":"VLOOKUP(A26,saisie!B$7:AL$26,32,0)","v":{"$error":"#N/A"}},{"$f":"VLOOKUP(A26,saisie!B$7:AL$26,33,0)","v":{"$error":"#N/A"}},{"$f":"VLOOKUP(A26,saisie!B$7:AL$26,34,0)","v":{"$error":"#N/A"}},{"$f":"VLOOKUP(A26,saisie!B$7:AL$26,35,0)","v":{"$error":"#N/A"}}]
[{"$f":"IF(INFO!B8>20,21,\"\")","v":""},{"$f":"VLOOKUP(A27,saisie!B$7:AL$26,2,0)","v":{"$error":"#N/A"}},{"$f":"VLOOKUP(A27,saisie!B$7:AL$26,3,0)","v":{"$error":"#N/A"}},{"$f":"VLOOKUP(A27,saisie!B$7:AL$26,4,0)","v":{"$error":"#N/A"}},{"$f":"VLOOKUP(A27,saisie!B$7:AL$26,5,0)","v":{"$error":"#N/A"}},{"$f":"VLOOKUP(A27,saisie!B$7:AL$26,6,0)","v":{"$error":"#N/A"}},{"$f":"VLOOKUP(A27,saisie!B$7:AL$26,7,0)","v":{"$error":"#N/A"}},{"$f":"VLOOKUP(A27,saisie!B$7:AL$26,8,0)","v":{"$error":"#N/A"}},{"$f":"VLOOKUP(A27,saisie!B$7:AL$26,9,0)","v":{"$error":"#N/A"}},{"$f":"VLOOKUP(A27,saisie!B$7:AL$26,10,0)","v":{"$error":"#N/A"}},{"$f":"VLOOKUP(A27,saisie!B$7:AL$26,11,0)","v":{"$error":"#N/A"}},{"$f":"VLOOKUP(A27,saisie!B$7:AL$26,12,0)","v":{"$error":"#N/A"}},{"$f":"VLOOKUP(A27,saisie!B$7:AL$26,13,0)","v":{"$error":"#N/A"}},{"$f":"VLOOKUP(A27,saisie!B$7:AL$26,14,0)","v":{"$error":"#N/A"}},{"$f":"VLOOKUP(A27,saisie!B$7:AL$26,15,0)","v":{"$error":"#N/A"}},{"$f":"VLOOKUP(A27,saisie!B$7:AL$26,16,0)","v":{"$error":"#N/A"}},{"$f":"VLOOKUP(A27,saisie!B$7:AL$26,17,0)","v":{"$error":"#N/A"}},{"$f":"VLOOKUP(A27,saisie!B$7:AL$26,18,0)","v":{"$error":"#N/A"}},{"$f":"VLOOKUP(A27,saisie!B$7:AL$26,19,0)","v":{"$error":"#N/A"}},{"$f":"VLOOKUP(A27,saisie!B$7:AL$26,20,0)","v":{"$error":"#N/A"}},{"$f":"VLOOKUP(A27,saisie!B$7:AL$26,21,0)","v":{"$error":"#N/A"}},{"$f":"VLOOKUP(A27,saisie!B$7:AL$26,22,0)","v":{"$error":"#N/A"}},{"$f":"VLOOKUP(A27,saisie!B$7:AL$26,23,0)","v":{"$error":"#N/A"}},{"$f":"VLOOKUP(A27,saisie!B$7:AL$26,24,0)","v":{"$error":"#N/A"}},{"$f":"VLOOKUP(A27,saisie!B$7:AL$26,25,0)","v":{"$error":"#N/A"}},{"$f":"VLOOKUP(A27,saisie!B$7:AL$26,26,0)","v":{"$error":"#N/A"}},{"$f":"VLOOKUP(A27,saisie!B$7:AL$26,27,0)","v":{"$error":"#N/A"}},{"$f":"VLOOKUP(A27,saisie!B$7:AL$26,28,0)","v":{"$error":"#N/A"}},{"$f":"VLOOKUP(A27,saisie!B$7:AL$26,29,0)","v":{"$error":"#N/A"}},{"$f":"VLOOKUP(A27,saisie!B$7:AL$26,30,0)","v":{"$error":"#N/A"}},{"$f":"VLOOKUP(A27,saisie!B$7:AL$26,31,0)","v":{"$error":"#N/A"}},{"$f":"VLOOKUP(A27,saisie!B$7:AL$26,32,0)","v":{"$error":"#N/A"}},{"$f":"VLOOKUP(A27,saisie!B$7:AL$26,33,0)","v":{"$error":"#N/A"}},{"$f":"VLOOKUP(A27,saisie!B$7:AL$26,34,0)","v":{"$error":"#N/A"}},{"$f":"VLOOKUP(A27,saisie!B$7:AL$26,35,0)","v":{"$error":"#N/A"}}]
[{"$f":"IF(INFO!B8>21,22,\"\")","v":""},{"$f":"VLOOKUP(A28,saisie!B$7:AL$26,2,0)","v":{"$error":"#N/A"}},{"$f":"VLOOKUP(A28,saisie!B$7:AL$26,3,0)","v":{"$error":"#N/A"}},{"$f":"VLOOKUP(A28,saisie!B$7:AL$26,4,0)","v":{"$error":"#N/A"}},{"$f":"VLOOKUP(A28,saisie!B$7:AL$26,5,0)","v":{"$error":"#N/A"}},{"$f":"VLOOKUP(A28,saisie!B$7:AL$26,6,0)","v":{"$error":"#N/A"}},{"$f":"VLOOKUP(A28,saisie!B$7:AL$26,7,0)","v":{"$error":"#N/A"}},{"$f":"VLOOKUP(A28,saisie!B$7:AL$26,8,0)","v":{"$error":"#N/A"}},{"$f":"VLOOKUP(A28,saisie!B$7:AL$26,9,0)","v":{"$error":"#N/A"}},{"$f":"VLOOKUP(A28,saisie!B$7:AL$26,10,0)","v":{"$error":"#N/A"}},{"$f":"VLOOKUP(A28,saisie!B$7:AL$26,11,0)","v":{"$error":"#N/A"}},{"$f":"VLOOKUP(A28,saisie!B$7:AL$26,12,0)","v":{"$error":"#N/A"}},{"$f":"VLOOKUP(A28,saisie!B$7:AL$26,13,0)","v":{"$error":"#N/A"}},{"$f":"VLOOKUP(A28,saisie!B$7:AL$26,14,0)","v":{"$error":"#N/A"}},{"$f":"VLOOKUP(A28,saisie!B$7:AL$26,15,0)","v":{"$error":"#N/A"}},{"$f":"VLOOKUP(A28,saisie!B$7:AL$26,16,0)","v":{"$error":"#N/A"}},{"$f":"VLOOKUP(A28,saisie!B$7:AL$26,17,0)","v":{"$error":"#N/A"}},{"$f":"VLOOKUP(A28,saisie!B$7:AL$26,18,0)","v":{"$error":"#N/A"}},{"$f":"VLOOKUP(A28,saisie!B$7:AL$26,19,0)","v":{"$error":"#N/A"}},{"$f":"VLOOKUP(A28,saisie!B$7:AL$26,20,0)","v":{"$error":"#N/A"}},{"$f":"VLOOKUP(A28,saisie!B$7:AL$26,21,0)","v":{"$error":"#N/A"}},{"$f":"VLOOKUP(A28,saisie!B$7:AL$26,22,0)","v":{"$error":"#N/A"}},{"$f":"VLOOKUP(A28,saisie!B$7:AL$26,23,0)","v":{"$error":"#N/A"}},{"$f":"VLOOKUP(A28,saisie!B$7:AL$26,24,0)","v":{"$error":"#N/A"}},{"$f":"VLOOKUP(A28,saisie!B$7:AL$26,25,0)","v":{"$error":"#N/A"}},{"$f":"VLOOKUP(A28,saisie!B$7:AL$26,26,0)","v":{"$error":"#N/A"}},{"$f":"VLOOKUP(A28,saisie!B$7:AL$26,27,0)","v":{"$error":"#N/A"}},{"$f":"VLOOKUP(A28,saisie!B$7:AL$26,28,0)","v":{"$error":"#N/A"}},{"$f":"VLOOKUP(A28,saisie!B$7:AL$26,29,0)","v":{"$error":"#N/A"}},{"$f":"VLOOKUP(A28,saisie!B$7:AL$26,30,0)","v":{"$error":"#N/A"}},{"$f":"VLOOKUP(A28,saisie!B$7:AL$26,31,0)","v":{"$error":"#N/A"}},{"$f":"VLOOKUP(A28,saisie!B$7:AL$26,32,0)","v":{"$error":"#N/A"}},{"$f":"VLOOKUP(A28,saisie!B$7:AL$26,33,0)","v":{"$error":"#N/A"}},{"$f":"VLOOKUP(A28,saisie!B$7:AL$26,34,0)","v":{"$error":"#N/A"}},{"$f":"VLOOKUP(A28,saisie!B$7:AL$26,35,0)","v":{"$error":"#N/A"}}]
[{"$f":"IF(INFO!B8>22,23,\"\")","v":""},{"$f":"VLOOKUP(A29,saisie!B$7:AL$26,2,0)","v":{"$error":"#N/A"}},{"$f":"VLOOKUP(A29,saisie!B$7:AL$26,3,0)","v":{"$error":"#N/A"}},{"$f":"VLOOKUP(A29,saisie!B$7:AL$26,4,0)","v":{"$error":"#N/A"}},{"$f":"VLOOKUP(A29,saisie!B$7:AL$26,5,0)","v":{"$error":"#N/A"}},{"$f":"VLOOKUP(A29,saisie!B$7:AL$26,6,0)","v":{"$error":"#N/A"}},{"$f":"VLOOKUP(A29,saisie!B$7:AL$26,7,0)","v":{"$error":"#N/A"}},{"$f":"VLOOKUP(A29,saisie!B$7:AL$26,8,0)","v":{"$error":"#N/A"}},{"$f":"VLOOKUP(A29,saisie!B$7:AL$26,9,0)","v":{"$error":"#N/A"}},{"$f":"VLOOKUP(A29,saisie!B$7:AL$26,10,0)","v":{"$error":"#N/A"}},{"$f":"VLOOKUP(A29,saisie!B$7:AL$26,11,0)","v":{"$error":"#N/A"}},{"$f":"VLOOKUP(A29,saisie!B$7:AL$26,12,0)","v":{"$error":"#N/A"}},{"$f":"VLOOKUP(A29,saisie!B$7:AL$26,13,0)","v":{"$error":"#N/A"}},{"$f":"VLOOKUP(A29,saisie!B$7:AL$26,14,0)","v":{"$error":"#N/A"}},{"$f":"VLOOKUP(A29,saisie!B$7:AL$26,15,0)","v":{"$error":"#N/A"}},{"$f":"VLOOKUP(A29,saisie!B$7:AL$26,16,0)","v":{"$error":"#N/A"}},{"$f":"VLOOKUP(A29,saisie!B$7:AL$26,17,0)","v":{"$error":"#N/A"}},{"$f":"VLOOKUP(A29,saisie!B$7:AL$26,18,0)","v":{"$error":"#N/A"}},{"$f":"VLOOKUP(A29,saisie!B$7:AL$26,19,0)","v":{"$error":"#N/A"}},{"$f":"VLOOKUP(A29,saisie!B$7:AL$26,20,0)","v":{"$error":"#N/A"}},{"$f":"VLOOKUP(A29,saisie!B$7:AL$26,21,0)","v":{"$error":"#N/A"}},{"$f":"VLOOKUP(A29,saisie!B$7:AL$26,22,0)","v":{"$error":"#N/A"}},{"$f":"VLOOKUP(A29,saisie!B$7:AL$26,23,0)","v":{"$error":"#N/A"}},{"$f":"VLOOKUP(A29,saisie!B$7:AL$26,24,0)","v":{"$error":"#N/A"}},{"$f":"VLOOKUP(A29,saisie!B$7:AL$26,25,0)","v":{"$error":"#N/A"}},{"$f":"VLOOKUP(A29,saisie!B$7:AL$26,26,0)","v":{"$error":"#N/A"}},{"$f":"VLOOKUP(A29,saisie!B$7:AL$26,27,0)","v":{"$error":"#N/A"}},{"$f":"VLOOKUP(A29,saisie!B$7:AL$26,28,0)","v":{"$error":"#N/A"}},{"$f":"VLOOKUP(A29,saisie!B$7:AL$26,29,0)","v":{"$error":"#N/A"}},{"$f":"VLOOKUP(A29,saisie!B$7:AL$26,30,0)","v":{"$error":"#N/A"}},{"$f":"VLOOKUP(A29,saisie!B$7:AL$26,31,0)","v":{"$error":"#N/A"}},{"$f":"VLOOKUP(A29,saisie!B$7:AL$26,32,0)","v":{"$error":"#N/A"}},{"$f":"VLOOKUP(A29,saisie!B$7:AL$26,33,0)","v":{"$error":"#N/A"}},{"$f":"VLOOKUP(A29,saisie!B$7:AL$26,34,0)","v":{"$error":"#N/A"}},{"$f":"VLOOKUP(A29,saisie!B$7:AL$26,35,0)","v":{"$error":"#N/A"}}]
[{"$f":"IF(INFO!B8>23,24,\"\")","v":""},{"$f":"VLOOKUP(A30,saisie!B$7:AL$26,2,0)","v":{"$error":"#N/A"}},{"$f":"VLOOKUP(A30,saisie!B$7:AL$26,3,0)","v":{"$error":"#N/A"}},{"$f":"VLOOKUP(A30,saisie!B$7:AL$26,4,0)","v":{"$error":"#N/A"}},{"$f":"VLOOKUP(A30,saisie!B$7:AL$26,5,0)","v":{"$error":"#N/A"}},{"$f":"VLOOKUP(A30,saisie!B$7:AL$26,6,0)","v":{"$error":"#N/A"}},{"$f":"VLOOKUP(A30,saisie!B$7:AL$26,7,0)","v":{"$error":"#N/A"}},{"$f":"VLOOKUP(A30,saisie!B$7:AL$26,8,0)","v":{"$error":"#N/A"}},{"$f":"VLOOKUP(A30,saisie!B$7:AL$26,9,0)","v":{"$error":"#N/A"}},{"$f":"VLOOKUP(A30,saisie!B$7:AL$26,10,0)","v":{"$error":"#N/A"}},{"$f":"VLOOKUP(A30,saisie!B$7:AL$26,11,0)","v":{"$error":"#N/A"}},{"$f":"VLOOKUP(A30,saisie!B$7:AL$26,12,0)","v":{"$error":"#N/A"}},{"$f":"VLOOKUP(A30,saisie!B$7:AL$26,13,0)","v":{"$error":"#N/A"}},{"$f":"VLOOKUP(A30,saisie!B$7:AL$26,14,0)","v":{"$error":"#N/A"}},{"$f":"VLOOKUP(A30,saisie!B$7:AL$26,15,0)","v":{"$error":"#N/A"}},{"$f":"VLOOKUP(A30,saisie!B$7:AL$26,16,0)","v":{"$error":"#N/A"}},{"$f":"VLOOKUP(A30,saisie!B$7:AL$26,17,0)","v":{"$error":"#N/A"}},{"$f":"VLOOKUP(A30,saisie!B$7:AL$26,18,0)","v":{"$error":"#N/A"}},{"$f":"VLOOKUP(A30,saisie!B$7:AL$26,19,0)","v":{"$error":"#N/A"}},{"$f":"VLOOKUP(A30,saisie!B$7:AL$26,20,0)","v":{"$error":"#N/A"}},{"$f":"VLOOKUP(A30,saisie!B$7:AL$26,21,0)","v":{"$error":"#N/A"}},{"$f":"VLOOKUP(A30,saisie!B$7:AL$26,22,0)","v":{"$error":"#N/A"}},{"$f":"VLOOKUP(A30,saisie!B$7:AL$26,23,0)","v":{"$error":"#N/A"}},{"$f":"VLOOKUP(A30,saisie!B$7:AL$26,24,0)","v":{"$error":"#N/A"}},{"$f":"VLOOKUP(A30,saisie!B$7:AL$26,25,0)","v":{"$error":"#N/A"}},{"$f":"VLOOKUP(A30,saisie!B$7:AL$26,26,0)","v":{"$error":"#N/A"}},{"$f":"VLOOKUP(A30,saisie!B$7:AL$26,27,0)","v":{"$error":"#N/A"}},{"$f":"VLOOKUP(A30,saisie!B$7:AL$26,28,0)","v":{"$error":"#N/A"}},{"$f":"VLOOKUP(A30,saisie!B$7:AL$26,29,0)","v":{"$error":"#N/A"}},{"$f":"VLOOKUP(A30,saisie!B$7:AL$26,30,0)","v":{"$error":"#N/A"}},{"$f":"VLOOKUP(A30,saisie!B$7:AL$26,31,0)","v":{"$error":"#N/A"}},{"$f":"VLOOKUP(A30,saisie!B$7:AL$26,32,0)","v":{"$error":"#N/A"}},{"$f":"VLOOKUP(A30,saisie!B$7:AL$26,33,0)","v":{"$error":"#N/A"}},{"$f":"VLOOKUP(A30,saisie!B$7:AL$26,34,0)","v":{"$error":"#N/A"}},{"$f":"VLOOKUP(A30,saisie!B$7:AL$26,35,0)","v":{"$error":"#N/A"}}]
[{"$f":"IF(INFO!B8>24,25,\"\")","v":""},{"$f":"VLOOKUP(A31,saisie!B$7:AL$26,2,0)","v":{"$error":"#N/A"}},{"$f":"VLOOKUP(A31,saisie!B$7:AL$26,3,0)","v":{"$error":"#N/A"}},{"$f":"VLOOKUP(A31,saisie!B$7:AL$26,4,0)","v":{"$error":"#N/A"}},{"$f":"VLOOKUP(A31,saisie!B$7:AL$26,5,0)","v":{"$error":"#N/A"}},{"$f":"VLOOKUP(A31,saisie!B$7:AL$26,6,0)","v":{"$error":"#N/A"}},{"$f":"VLOOKUP(A31,saisie!B$7:AL$26,7,0)","v":{"$error":"#N/A"}},{"$f":"VLOOKUP(A31,saisie!B$7:AL$26,8,0)","v":{"$error":"#N/A"}},{"$f":"VLOOKUP(A31,saisie!B$7:AL$26,9,0)","v":{"$error":"#N/A"}},{"$f":"VLOOKUP(A31,saisie!B$7:AL$26,10,0)","v":{"$error":"#N/A"}},{"$f":"VLOOKUP(A31,saisie!B$7:AL$26,11,0)","v":{"$error":"#N/A"}},{"$f":"VLOOKUP(A31,saisie!B$7:AL$26,12,0)","v":{"$error":"#N/A"}},{"$f":"VLOOKUP(A31,saisie!B$7:AL$26,13,0)","v":{"$error":"#N/A"}},{"$f":"VLOOKUP(A31,saisie!B$7:AL$26,14,0)","v":{"$error":"#N/A"}},{"$f":"VLOOKUP(A31,saisie!B$7:AL$26,15,0)","v":{"$error":"#N/A"}},{"$f":"VLOOKUP(A31,saisie!B$7:AL$26,16,0)","v":{"$error":"#N/A"}},{"$f":"VLOOKUP(A31,saisie!B$7:AL$26,17,0)","v":{"$error":"#N/A"}},{"$f":"VLOOKUP(A31,saisie!B$7:AL$26,18,0)","v":{"$error":"#N/A"}},{"$f":"VLOOKUP(A31,saisie!B$7:AL$26,19,0)","v":{"$error":"#N/A"}},{"$f":"VLOOKUP(A31,saisie!B$7:AL$26,20,0)","v":{"$error":"#N/A"}},{"$f":"VLOOKUP(A31,saisie!B$7:AL$26,21,0)","v":{"$error":"#N/A"}},{"$f":"VLOOKUP(A31,saisie!B$7:AL$26,22,0)","v":{"$error":"#N/A"}},{"$f":"VLOOKUP(A31,saisie!B$7:AL$26,23,0)","v":{"$error":"#N/A"}},{"$f":"VLOOKUP(A31,saisie!B$7:AL$26,24,0)","v":{"$error":"#N/A"}},{"$f":"VLOOKUP(A31,saisie!B$7:AL$26,25,0)","v":{"$error":"#N/A"}},{"$f":"VLOOKUP(A31,saisie!B$7:AL$26,26,0)","v":{"$error":"#N/A"}},{"$f":"VLOOKUP(A31,saisie!B$7:AL$26,27,0)","v":{"$error":"#N/A"}},{"$f":"VLOOKUP(A31,saisie!B$7:AL$26,28,0)","v":{"$error":"#N/A"}},{"$f":"VLOOKUP(A31,saisie!B$7:AL$26,29,0)","v":{"$error":"#N/A"}},{"$f":"VLOOKUP(A31,saisie!B$7:AL$26,30,0)","v":{"$error":"#N/A"}},{"$f":"VLOOKUP(A31,saisie!B$7:AL$26,31,0)","v":{"$error":"#N/A"}},{"$f":"VLOOKUP(A31,saisie!B$7:AL$26,32,0)","v":{"$error":"#N/A"}},{"$f":"VLOOKUP(A31,saisie!B$7:AL$26,33,0)","v":{"$error":"#N/A"}},{"$f":"VLOOKUP(A31,saisie!B$7:AL$26,34,0)","v":{"$error":"#N/A"}},{"$f":"VLOOKUP(A31,saisie!B$7:AL$26,35,0)","v":{"$error":"#N/A"}}]
[{"$f":"IF(INFO!B8>25,26,\"\")","v":""},{"$f":"VLOOKUP(A32,saisie!B$7:AL$26,2,0)","v":{"$error":"#N/A"}},{"$f":"VLOOKUP(A32,saisie!B$7:AL$26,3,0)","v":{"$error":"#N/A"}},{"$f":"VLOOKUP(A32,saisie!B$7:AL$26,4,0)","v":{"$error":"#N/A"}},{"$f":"VLOOKUP(A32,saisie!B$7:AL$26,5,0)","v":{"$error":"#N/A"}},{"$f":"VLOOKUP(A32,saisie!B$7:AL$26,6,0)","v":{"$error":"#N/A"}},{"$f":"VLOOKUP(A32,saisie!B$7:AL$26,7,0)","v":{"$error":"#N/A"}},{"$f":"VLOOKUP(A32,saisie!B$7:AL$26,8,0)","v":{"$error":"#N/A"}},{"$f":"VLOOKUP(A32,saisie!B$7:AL$26,9,0)","v":{"$error":"#N/A"}},{"$f":"VLOOKUP(A32,saisie!B$7:AL$26,10,0)","v":{"$error":"#N/A"}},{"$f":"VLOOKUP(A32,saisie!B$7:AL$26,11,0)","v":{"$error":"#N/A"}},{"$f":"VLOOKUP(A32,saisie!B$7:AL$26,12,0)","v":{"$error":"#N/A"}},{"$f":"VLOOKUP(A32,saisie!B$7:AL$26,13,0)","v":{"$error":"#N/A"}},{"$f":"VLOOKUP(A32,saisie!B$7:AL$26,14,0)","v":{"$error":"#N/A"}},{"$f":"VLOOKUP(A32,saisie!B$7:AL$26,15,0)","v":{"$error":"#N/A"}},{"$f":"VLOOKUP(A32,saisie!B$7:AL$26,16,0)","v":{"$error":"#N/A"}},{"$f":"VLOOKUP(A32,saisie!B$7:AL$26,17,0)","v":{"$error":"#N/A"}},{"$f":"VLOOKUP(A32,saisie!B$7:AL$26,18,0)","v":{"$error":"#N/A"}},{"$f":"VLOOKUP(A32,saisie!B$7:AL$26,19,0)","v":{"$error":"#N/A"}},{"$f":"VLOOKUP(A32,saisie!B$7:AL$26,20,0)","v":{"$error":"#N/A"}},{"$f":"VLOOKUP(A32,saisie!B$7:AL$26,21,0)","v":{"$error":"#N/A"}},{"$f":"VLOOKUP(A32,saisie!B$7:AL$26,22,0)","v":{"$error":"#N/A"}},{"$f":"VLOOKUP(A32,saisie!B$7:AL$26,23,0)","v":{"$error":"#N/A"}},{"$f":"VLOOKUP(A32,saisie!B$7:AL$26,24,0)","v":{"$error":"#N/A"}},{"$f":"VLOOKUP(A32,saisie!B$7:AL$26,25,0)","v":{"$error":"#N/A"}},{"$f":"VLOOKUP(A32,saisie!B$7:AL$26,26,0)","v":{"$error":"#N/A"}},{"$f":"VLOOKUP(A32,saisie!B$7:AL$26,27,0)","v":{"$error":"#N/A"}},{"$f":"VLOOKUP(A32,saisie!B$7:AL$26,28,0)","v":{"$error":"#N/A"}},{"$f":"VLOOKUP(A32,saisie!B$7:AL$26,29,0)","v":{"$error":"#N/A"}},{"$f":"VLOOKUP(A32,saisie!B$7:AL$26,30,0)","v":{"$error":"#N/A"}},{"$f":"VLOOKUP(A32,saisie!B$7:AL$26,31,0)","v":{"$error":"#N/A"}},{"$f":"VLOOKUP(A32,saisie!B$7:AL$26,32,0)","v":{"$error":"#N/A"}},{"$f":"VLOOKUP(A32,saisie!B$7:AL$26,33,0)","v":{"$error":"#N/A"}},{"$f":"VLOOKUP(A32,saisie!B$7:AL$26,34,0)","v":{"$error":"#N/A"}},{"$f":"VLOOKUP(A32,saisie!B$7:AL$26,35,0)","v":{"$error":"#N/A"}}]
[{"$f":"IF(INFO!B8>26,27,\"\")","v":""},{"$f":"VLOOKUP(A33,saisie!B$7:AL$26,2,0)","v":{"$error":"#N/A"}},{"$f":"VLOOKUP(A33,saisie!B$7:AL$26,3,0)","v":{"$error":"#N/A"}},{"$f":"VLOOKUP(A33,saisie!B$7:AL$26,4,0)","v":{"$error":"#N/A"}},{"$f":"VLOOKUP(A33,saisie!B$7:AL$26,5,0)","v":{"$error":"#N/A"}},{"$f":"VLOOKUP(A33,saisie!B$7:AL$26,6,0)","v":{"$error":"#N/A"}},{"$f":"VLOOKUP(A33,saisie!B$7:AL$26,7,0)","v":{"$error":"#N/A"}},{"$f":"VLOOKUP(A33,saisie!B$7:AL$26,8,0)","v":{"$error":"#N/A"}},{"$f":"VLOOKUP(A33,saisie!B$7:AL$26,9,0)","v":{"$error":"#N/A"}},{"$f":"VLOOKUP(A33,saisie!B$7:AL$26,10,0)","v":{"$error":"#N/A"}},{"$f":"VLOOKUP(A33,saisie!B$7:AL$26,11,0)","v":{"$error":"#N/A"}},{"$f":"VLOOKUP(A33,saisie!B$7:AL$26,12,0)","v":{"$error":"#N/A"}},{"$f":"VLOOKUP(A33,saisie!B$7:AL$26,13,0)","v":{"$error":"#N/A"}},{"$f":"VLOOKUP(A33,saisie!B$7:AL$26,14,0)","v":{"$error":"#N/A"}},{"$f":"VLOOKUP(A33,saisie!B$7:AL$26,15,0)","v":{"$error":"#N/A"}},{"$f":"VLOOKUP(A33,saisie!B$7:AL$26,16,0)","v":{"$error":"#N/A"}},{"$f":"VLOOKUP(A33,saisie!B$7:AL$26,17,0)","v":{"$error":"#N/A"}},{"$f":"VLOOKUP(A33,saisie!B$7:AL$26,18,0)","v":{"$error":"#N/A"}},{"$f":"VLOOKUP(A33,saisie!B$7:AL$26,19,0)","v":{"$error":"#N/A"}},{"$f":"VLOOKUP(A33,saisie!B$7:AL$26,20,0)","v":{"$error":"#N/A"}},{"$f":"VLOOKUP(A33,saisie!B$7:AL$26,21,0)","v":{"$error":"#N/A"}},{"$f":"VLOOKUP(A33,saisie!B$7:AL$26,22,0)","v":{"$error":"#N/A"}},{"$f":"VLOOKUP(A33,saisie!B$7:AL$26,23,0)","v":{"$error":"#N/A"}},{"$f":"VLOOKUP(A33,saisie!B$7:AL$26,24,0)","v":{"$error":"#N/A"}},{"$f":"VLOOKUP(A33,saisie!B$7:AL$26,25,0)","v":{"$error":"#N/A"}},{"$f":"VLOOKUP(A33,saisie!B$7:AL$26,26,0)","v":{"$error":"#N/A"}},{"$f":"VLOOKUP(A33,saisie!B$7:AL$26,27,0)","v":{"$error":"#N/A"}},{"$f":"VLOOKUP(A33,saisie!B$7:AL$26,28,0)","v":{"$error":"#N/A"}},{"$f":"VLOOKUP(A33,saisie!B$7:AL$26,29,0)","v":{"$error":"#N/A"}},{"$f":"VLOOKUP(A33,saisie!B$7:AL$26,30,0)","v":{"$error":"#N/A"}},{"$f":"VLOOKUP(A33,saisie!B$7:AL$26,31,0)","v":{"$error":"#N/A"}},{"$f":"VLOOKUP(A33,saisie!B$7:AL$26,32,0)","v":{"$error":"#N/A"}},{"$f":"VLOOKUP(A33,saisie!B$7:AL$26,33,0)","v":{"$error":"#N/A"}},{"$f":"VLOOKUP(A33,saisie!B$7:AL$26,34,0)","v":{"$error":"#N/A"}},{"$f":"VLOOKUP(A33,saisie!B$7:AL$26,35,0)","v":{"$error":"#N/A"}}]
[{"$f":"IF(INFO!B8>27,28,\"\")","v":""},{"$f":"VLOOKUP(A34,saisie!B$7:AL$26,2,0)","v":{"$error":"#N/A"}},{"$f":"VLOOKUP(A34,saisie!B$7:AL$26,3,0)","v":{"$error":"#N/A"}},{"$f":"VLOOKUP(A34,saisie!B$7:AL$26,4,0)","v":{"$error":"#N/A"}},{"$f":"VLOOKUP(A34,saisie!B$7:AL$26,5,0)","v":{"$error":"#N/A"}},{"$f":"VLOOKUP(A34,saisie!B$7:AL$26,6,0)","v":{"$error":"#N/A"}},{"$f":"VLOOKUP(A34,saisie!B$7:AL$26,7,0)","v":{"$error":"#N/A"}},{"$f":"VLOOKUP(A34,saisie!B$7:AL$26,8,0)","v":{"$error":"#N/A"}},{"$f":"VLOOKUP(A34,saisie!B$7:AL$26,9,0)","v":{"$error":"#N/A"}},{"$f":"VLOOKUP(A34,saisie!B$7:AL$26,10,0)","v":{"$error":"#N/A"}},{"$f":"VLOOKUP(A34,saisie!B$7:AL$26,11,0)","v":{"$error":"#N/A"}},{"$f":"VLOOKUP(A34,saisie!B$7:AL$26,12,0)","v":{"$error":"#N/A"}},{"$f":"VLOOKUP(A34,saisie!B$7:AL$26,13,0)","v":{"$error":"#N/A"}},{"$f":"VLOOKUP(A34,saisie!B$7:AL$26,14,0)","v":{"$error":"#N/A"}},{"$f":"VLOOKUP(A34,saisie!B$7:AL$26,15,0)","v":{"$error":"#N/A"}},{"$f":"VLOOKUP(A34,saisie!B$7:AL$26,16,0)","v":{"$error":"#N/A"}},{"$f":"VLOOKUP(A34,saisie!B$7:AL$26,17,0)","v":{"$error":"#N/A"}},{"$f":"VLOOKUP(A34,saisie!B$7:AL$26,18,0)","v":{"$error":"#N/A"}},{"$f":"VLOOKUP(A34,saisie!B$7:AL$26,19,0)","v":{"$error":"#N/A"}},{"$f":"VLOOKUP(A34,saisie!B$7:AL$26,20,0)","v":{"$error":"#N/A"}},{"$f":"VLOOKUP(A34,saisie!B$7:AL$26,21,0)","v":{"$error":"#N/A"}},{"$f":"VLOOKUP(A34,saisie!B$7:AL$26,22,0)","v":{"$error":"#N/A"}},{"$f":"VLOOKUP(A34,saisie!B$7:AL$26,23,0)","v":{"$error":"#N/A"}},{"$f":"VLOOKUP(A34,saisie!B$7:AL$26,24,0)","v":{"$error":"#N/A"}},{"$f":"VLOOKUP(A34,saisie!B$7:AL$26,25,0)","v":{"$error":"#N/A"}},{"$f":"VLOOKUP(A34,saisie!B$7:AL$26,26,0)","v":{"$error":"#N/A"}},{"$f":"VLOOKUP(A34,saisie!B$7:AL$26,27,0)","v":{"$error":"#N/A"}},{"$f":"VLOOKUP(A34,saisie!B$7:AL$26,28,0)","v":{"$error":"#N/A"}},{"$f":"VLOOKUP(A34,saisie!B$7:AL$26,29,0)","v":{"$error":"#N/A"}},{"$f":"VLOOKUP(A34,saisie!B$7:AL$26,30,0)","v":{"$error":"#N/A"}},{"$f":"VLOOKUP(A34,saisie!B$7:AL$26,31,0)","v":{"$error":"#N/A"}},{"$f":"VLOOKUP(A34,saisie!B$7:AL$26,32,0)","v":{"$error":"#N/A"}},{"$f":"VLOOKUP(A34,saisie!B$7:AL$26,33,0)","v":{"$error":"#N/A"}},{"$f":"VLOOKUP(A34,saisie!B$7:AL$26,34,0)","v":{"$error":"#N/A"}},{"$f":"VLOOKUP(A34,saisie!B$7:AL$26,35,0)","v":{"$error":"#N/A"}}]
[{"$f":"IF(INFO!B8>28,29,\"\")","v":""},{"$f":"VLOOKUP(A35,saisie!B$7:AL$26,2,0)","v":{"$error":"#N/A"}},{"$f":"VLOOKUP(A35,saisie!B$7:AL$26,3,0)","v":{"$error":"#N/A"}},{"$f":"VLOOKUP(A35,saisie!B$7:AL$26,4,0)","v":{"$error":"#N/A"}},{"$f":"VLOOKUP(A35,saisie!B$7:AL$26,5,0)","v":{"$error":"#N/A"}},{"$f":"VLOOKUP(A35,saisie!B$7:AL$26,6,0)","v":{"$error":"#N/A"}},{"$f":"VLOOKUP(A35,saisie!B$7:AL$26,7,0)","v":{"$error":"#N/A"}},{"$f":"VLOOKUP(A35,saisie!B$7:AL$26,8,0)","v":{"$error":"#N/A"}},{"$f":"VLOOKUP(A35,saisie!B$7:AL$26,9,0)","v":{"$error":"#N/A"}},{"$f":"VLOOKUP(A35,saisie!B$7:AL$26,10,0)","v":{"$error":"#N/A"}},{"$f":"VLOOKUP(A35,saisie!B$7:AL$26,11,0)","v":{"$error":"#N/A"}},{"$f":"VLOOKUP(A35,saisie!B$7:AL$26,12,0)","v":{"$error":"#N/A"}},{"$f":"VLOOKUP(A35,saisie!B$7:AL$26,13,0)","v":{"$error":"#N/A"}},{"$f":"VLOOKUP(A35,saisie!B$7:AL$26,14,0)","v":{"$error":"#N/A"}},{"$f":"VLOOKUP(A35,saisie!B$7:AL$26,15,0)","v":{"$error":"#N/A"}},{"$f":"VLOOKUP(A35,saisie!B$7:AL$26,16,0)","v":{"$error":"#N/A"}},{"$f":"VLOOKUP(A35,saisie!B$7:AL$26,17,0)","v":{"$error":"#N/A"}},{"$f":"VLOOKUP(A35,saisie!B$7:AL$26,18,0)","v":{"$error":"#N/A"}},{"$f":"VLOOKUP(A35,saisie!B$7:AL$26,19,0)","v":{"$error":"#N/A"}},{"$f":"VLOOKUP(A35,saisie!B$7:AL$26,20,0)","v":{"$error":"#N/A"}},{"$f":"VLOOKUP(A35,saisie!B$7:AL$26,21,0)","v":{"$error":"#N/A"}},{"$f":"VLOOKUP(A35,saisie!B$7:AL$26,22,0)","v":{"$error":"#N/A"}},{"$f":"VLOOKUP(A35,saisie!B$7:AL$26,23,0)","v":{"$error":"#N/A"}},{"$f":"VLOOKUP(A35,saisie!B$7:AL$26,24,0)","v":{"$error":"#N/A"}},{"$f":"VLOOKUP(A35,saisie!B$7:AL$26,25,0)","v":{"$error":"#N/A"}},{"$f":"VLOOKUP(A35,saisie!B$7:AL$26,26,0)","v":{"$error":"#N/A"}},{"$f":"VLOOKUP(A35,saisie!B$7:AL$26,27,0)","v":{"$error":"#N/A"}},{"$f":"VLOOKUP(A35,saisie!B$7:AL$26,28,0)","v":{"$error":"#N/A"}},{"$f":"VLOOKUP(A35,saisie!B$7:AL$26,29,0)","v":{"$error":"#N/A"}},{"$f":"VLOOKUP(A35,saisie!B$7:AL$26,30,0)","v":{"$error":"#N/A"}},{"$f":"VLOOKUP(A35,saisie!B$7:AL$26,31,0)","v":{"$error":"#N/A"}},{"$f":"VLOOKUP(A35,saisie!B$7:AL$26,32,0)","v":{"$error":"#N/A"}},{"$f":"VLOOKUP(A35,saisie!B$7:AL$26,33,0)","v":{"$error":"#N/A"}},{"$f":"VLOOKUP(A35,saisie!B$7:AL$26,34,0)","v":{"$error":"#N/A"}},{"$f":"VLOOKUP(A35,saisie!B$7:AL$26,35,0)","v":{"$error":"#N/A"}}]
[{"$f":"IF(INFO!B8>29,30,\"\")","v":""},{"$f":"VLOOKUP(A36,saisie!B$7:AL$26,2,0)","v":{"$error":"#N/A"}},{"$f":"VLOOKUP(A36,saisie!B$7:AL$26,3,0)","v":{"$error":"#N/A"}},{"$f":"VLOOKUP(A36,saisie!B$7:AL$26,4,0)","v":{"$error":"#N/A"}},{"$f":"VLOOKUP(A36,saisie!B$7:AL$26,5,0)","v":{"$error":"#N/A"}},{"$f":"VLOOKUP(A36,saisie!B$7:AL$26,6,0)","v":{"$error":"#N/A"}},{"$f":"VLOOKUP(A36,saisie!B$7:AL$26,7,0)","v":{"$error":"#N/A"}},{"$f":"VLOOKUP(A36,saisie!B$7:AL$26,8,0)","v":{"$error":"#N/A"}},{"$f":"VLOOKUP(A36,saisie!B$7:AL$26,9,0)","v":{"$error":"#N/A"}},{"$f":"VLOOKUP(A36,saisie!B$7:AL$26,10,0)","v":{"$error":"#N/A"}},{"$f":"VLOOKUP(A36,saisie!B$7:AL$26,11,0)","v":{"$error":"#N/A"}},{"$f":"VLOOKUP(A36,saisie!B$7:AL$26,12,0)","v":{"$error":"#N/A"}},{"$f":"VLOOKUP(A36,saisie!B$7:AL$26,13,0)","v":{"$error":"#N/A"}},{"$f":"VLOOKUP(A36,saisie!B$7:AL$26,14,0)","v":{"$error":"#N/A"}},{"$f":"VLOOKUP(A36,saisie!B$7:AL$26,15,0)","v":{"$error":"#N/A"}},{"$f":"VLOOKUP(A36,saisie!B$7:AL$26,16,0)","v":{"$error":"#N/A"}},{"$f":"VLOOKUP(A36,saisie!B$7:AL$26,17,0)","v":{"$error":"#N/A"}},{"$f":"VLOOKUP(A36,saisie!B$7:AL$26,18,0)","v":{"$error":"#N/A"}},{"$f":"VLOOKUP(A36,saisie!B$7:AL$26,19,0)","v":{"$error":"#N/A"}},{"$f":"VLOOKUP(A36,saisie!B$7:AL$26,20,0)","v":{"$error":"#N/A"}},{"$f":"VLOOKUP(A36,saisie!B$7:AL$26,21,0)","v":{"$error":"#N/A"}},{"$f":"VLOOKUP(A36,saisie!B$7:AL$26,22,0)","v":{"$error":"#N/A"}},{"$f":"VLOOKUP(A36,saisie!B$7:AL$26,23,0)","v":{"$error":"#N/A"}},{"$f":"VLOOKUP(A36,saisie!B$7:AL$26,24,0)","v":{"$error":"#N/A"}},{"$f":"VLOOKUP(A36,saisie!B$7:AL$26,25,0)","v":{"$error":"#N/A"}},{"$f":"VLOOKUP(A36,saisie!B$7:AL$26,26,0)","v":{"$error":"#N/A"}},{"$f":"VLOOKUP(A36,saisie!B$7:AL$26,27,0)","v":{"$error":"#N/A"}},{"$f":"VLOOKUP(A36,saisie!B$7:AL$26,28,0)","v":{"$error":"#N/A"}},{"$f":"VLOOKUP(A36,saisie!B$7:AL$26,29,0)","v":{"$error":"#N/A"}},{"$f":"VLOOKUP(A36,saisie!B$7:AL$26,30,0)","v":{"$error":"#N/A"}},{"$f":"VLOOKUP(A36,saisie!B$7:AL$26,31,0)","v":{"$error":"#N/A"}},{"$f":"VLOOKUP(A36,saisie!B$7:AL$26,32,0)","v":{"$error":"#N/A"}},{"$f":"VLOOKUP(A36,saisie!B$7:AL$26,33,0)","v":{"$error":"#N/A"}},{"$f":"VLOOKUP(A36,saisie!B$7:AL$26,34,0)","v":{"$error":"#N/A"}},{"$f":"VLOOKUP(A36,saisie!B$7:AL$26,35,0)","v":{"$error":"#N/A"}}]
[{"$f":"IF(INFO!B8>30,31,\"\")","v":""},{"$f":"VLOOKUP(A37,saisie!B$7:AL$26,2,0)","v":{"$error":"#N/A"}},{"$f":"VLOOKUP(A37,saisie!B$7:AL$26,3,0)","v":{"$error":"#N/A"}},{"$f":"VLOOKUP(A37,saisie!B$7:AL$26,4,0)","v":{"$error":"#N/A"}},{"$f":"VLOOKUP(A37,saisie!B$7:AL$26,5,0)","v":{"$error":"#N/A"}},{"$f":"VLOOKUP(A37,saisie!B$7:AL$26,6,0)","v":{"$error":"#N/A"}},{"$f":"VLOOKUP(A37,saisie!B$7:AL$26,7,0)","v":{"$error":"#N/A"}},{"$f":"VLOOKUP(A37,saisie!B$7:AL$26,8,0)","v":{"$error":"#N/A"}},{"$f":"VLOOKUP(A37,saisie!B$7:AL$26,9,0)","v":{"$error":"#N/A"}},{"$f":"VLOOKUP(A37,saisie!B$7:AL$26,10,0)","v":{"$error":"#N/A"}},{"$f":"VLOOKUP(A37,saisie!B$7:AL$26,11,0)","v":{"$error":"#N/A"}},{"$f":"VLOOKUP(A37,saisie!B$7:AL$26,12,0)","v":{"$error":"#N/A"}},{"$f":"VLOOKUP(A37,saisie!B$7:AL$26,13,0)","v":{"$error":"#N/A"}},{"$f":"VLOOKUP(A37,saisie!B$7:AL$26,14,0)","v":{"$error":"#N/A"}},{"$f":"VLOOKUP(A37,saisie!B$7:AL$26,15,0)","v":{"$error":"#N/A"}},{"$f":"VLOOKUP(A37,saisie!B$7:AL$26,16,0)","v":{"$error":"#N/A"}},{"$f":"VLOOKUP(A37,saisie!B$7:AL$26,17,0)","v":{"$error":"#N/A"}},{"$f":"VLOOKUP(A37,saisie!B$7:AL$26,18,0)","v":{"$error":"#N/A"}},{"$f":"VLOOKUP(A37,saisie!B$7:AL$26,19,0)","v":{"$error":"#N/A"}},{"$f":"VLOOKUP(A37,saisie!B$7:AL$26,20,0)","v":{"$error":"#N/A"}},{"$f":"VLOOKUP(A37,saisie!B$7:AL$26,21,0)","v":{"$error":"#N/A"}},{"$f":"VLOOKUP(A37,saisie!B$7:AL$26,22,0)","v":{"$error":"#N/A"}},{"$f":"VLOOKUP(A37,saisie!B$7:AL$26,23,0)","v":{"$error":"#N/A"}},{"$f":"VLOOKUP(A37,saisie!B$7:AL$26,24,0)","v":{"$error":"#N/A"}},{"$f":"VLOOKUP(A37,saisie!B$7:AL$26,25,0)","v":{"$error":"#N/A"}},{"$f":"VLOOKUP(A37,saisie!B$7:AL$26,26,0)","v":{"$error":"#N/A"}},{"$f":"VLOOKUP(A37,saisie!B$7:AL$26,27,0)","v":{"$error":"#N/A"}},{"$f":"VLOOKUP(A37,saisie!B$7:AL$26,28,0)","v":{"$error":"#N/A"}},{"$f":"VLOOKUP(A37,saisie!B$7:AL$26,29,0)","v":{"$error":"#N/A"}},{"$f":"VLOOKUP(A37,saisie!B$7:AL$26,30,0)","v":{"$error":"#N/A"}},{"$f":"VLOOKUP(A37,saisie!B$7:AL$26,31,0)","v":{"$error":"#N/A"}},{"$f":"VLOOKUP(A37,saisie!B$7:AL$26,32,0)","v":{"$error":"#N/A"}},{"$f":"VLOOKUP(A37,saisie!B$7:AL$26,33,0)","v":{"$error":"#N/A"}},{"$f":"VLOOKUP(A37,saisie!B$7:AL$26,34,0)","v":{"$error":"#N/A"}},{"$f":"VLOOKUP(A37,saisie!B$7:AL$26,35,0)","v":{"$error":"#N/A"}}]
[{"$f":"IF(INFO!B8>31,32,\"\")","v":""},{"$f":"VLOOKUP(A38,saisie!B$7:AL$26,2,0)","v":{"$error":"#N/A"}},{"$f":"VLOOKUP(A38,saisie!B$7:AL$26,3,0)","v":{"$error":"#N/A"}},{"$f":"VLOOKUP(A38,saisie!B$7:AL$26,4,0)","v":{"$error":"#N/A"}},{"$f":"VLOOKUP(A38,saisie!B$7:AL$26,5,0)","v":{"$error":"#N/A"}},{"$f":"VLOOKUP(A38,saisie!B$7:AL$26,6,0)","v":{"$error":"#N/A"}},{"$f":"VLOOKUP(A38,saisie!B$7:AL$26,7,0)","v":{"$error":"#N/A"}},{"$f":"VLOOKUP(A38,saisie!B$7:AL$26,8,0)","v":{"$error":"#N/A"}},{"$f":"VLOOKUP(A38,saisie!B$7:AL$26,9,0)","v":{"$error":"#N/A"}},{"$f":"VLOOKUP(A38,saisie!B$7:AL$26,10,0)","v":{"$error":"#N/A"}},{"$f":"VLOOKUP(A38,saisie!B$7:AL$26,11,0)","v":{"$error":"#N/A"}},{"$f":"VLOOKUP(A38,saisie!B$7:AL$26,12,0)","v":{"$error":"#N/A"}},{"$f":"VLOOKUP(A38,saisie!B$7:AL$26,13,0)","v":{"$error":"#N/A"}},{"$f":"VLOOKUP(A38,saisie!B$7:AL$26,14,0)","v":{"$error":"#N/A"}},{"$f":"VLOOKUP(A38,saisie!B$7:AL$26,15,0)","v":{"$error":"#N/A"}},{"$f":"VLOOKUP(A38,saisie!B$7:AL$26,16,0)","v":{"$error":"#N/A"}},{"$f":"VLOOKUP(A38,saisie!B$7:AL$26,17,0)","v":{"$error":"#N/A"}},{"$f":"VLOOKUP(A38,saisie!B$7:AL$26,18,0)","v":{"$error":"#N/A"}},{"$f":"VLOOKUP(A38,saisie!B$7:AL$26,19,0)","v":{"$error":"#N/A"}},{"$f":"VLOOKUP(A38,saisie!B$7:AL$26,20,0)","v":{"$error":"#N/A"}},{"$f":"VLOOKUP(A38,saisie!B$7:AL$26,21,0)","v":{"$error":"#N/A"}},{"$f":"VLOOKUP(A38,saisie!B$7:AL$26,22,0)","v":{"$error":"#N/A"}},{"$f":"VLOOKUP(A38,saisie!B$7:AL$26,23,0)","v":{"$error":"#N/A"}},{"$f":"VLOOKUP(A38,saisie!B$7:AL$26,24,0)","v":{"$error":"#N/A"}},{"$f":"VLOOKUP(A38,saisie!B$7:AL$26,25,0)","v":{"$error":"#N/A"}},{"$f":"VLOOKUP(A38,saisie!B$7:AL$26,26,0)","v":{"$error":"#N/A"}},{"$f":"VLOOKUP(A38,saisie!B$7:AL$26,27,0)","v":{"$error":"#N/A"}},{"$f":"VLOOKUP(A38,saisie!B$7:AL$26,28,0)","v":{"$error":"#N/A"}},{"$f":"VLOOKUP(A38,saisie!B$7:AL$26,29,0)","v":{"$error":"#N/A"}},{"$f":"VLOOKUP(A38,saisie!B$7:AL$26,30,0)","v":{"$error":"#N/A"}},{"$f":"VLOOKUP(A38,saisie!B$7:AL$26,31,0)","v":{"$error":"#N/A"}},{"$f":"VLOOKUP(A38,saisie!B$7:AL$26,32,0)","v":{"$error":"#N/A"}},{"$f":"VLOOKUP(A38,saisie!B$7:AL$26,33,0)","v":{"$error":"#N/A"}},{"$f":"VLOOKUP(A38,saisie!B$7:AL$26,34,0)","v":{"$error":"#N/A"}},{"$f":"VLOOKUP(A38,saisie!B$7:AL$26,35,0)","v":{"$error":"#N/A"}}]
[{"$f":"IF(INFO!B8>32,33,\"\")","v":""},{"$f":"VLOOKUP(A39,saisie!B$7:AL$26,2,0)","v":{"$error":"#N/A"}},{"$f":"VLOOKUP(A39,saisie!B$7:AL$26,3,0)","v":{"$error":"#N/A"}},{"$f":"VLOOKUP(A39,saisie!B$7:AL$26,4,0)","v":{"$error":"#N/A"}},{"$f":"VLOOKUP(A39,saisie!B$7:AL$26,5,0)","v":{"$error":"#N/A"}},{"$f":"VLOOKUP(A39,saisie!B$7:AL$26,6,0)","v":{"$error":"#N/A"}},{"$f":"VLOOKUP(A39,saisie!B$7:AL$26,7,0)","v":{"$error":"#N/A"}},{"$f":"VLOOKUP(A39,saisie!B$7:AL$26,8,0)","v":{"$error":"#N/A"}},{"$f":"VLOOKUP(A39,saisie!B$7:AL$26,9,0)","v":{"$error":"#N/A"}},{"$f":"VLOOKUP(A39,saisie!B$7:AL$26,10,0)","v":{"$error":"#N/A"}},{"$f":"VLOOKUP(A39,saisie!B$7:AL$26,11,0)","v":{"$error":"#N/A"}},{"$f":"VLOOKUP(A39,saisie!B$7:AL$26,12,0)","v":{"$error":"#N/A"}},{"$f":"VLOOKUP(A39,saisie!B$7:AL$26,13,0)","v":{"$error":"#N/A"}},{"$f":"VLOOKUP(A39,saisie!B$7:AL$26,14,0)","v":{"$error":"#N/A"}},{"$f":"VLOOKUP(A39,saisie!B$7:AL$26,15,0)","v":{"$error":"#N/A"}},{"$f":"VLOOKUP(A39,saisie!B$7:AL$26,16,0)","v":{"$error":"#N/A"}},{"$f":"VLOOKUP(A39,saisie!B$7:AL$26,17,0)","v":{"$error":"#N/A"}},{"$f":"VLOOKUP(A39,saisie!B$7:AL$26,18,0)","v":{"$error":"#N/A"}},{"$f":"VLOOKUP(A39,saisie!B$7:AL$26,19,0)","v":{"$error":"#N/A"}},{"$f":"VLOOKUP(A39,saisie!B$7:AL$26,20,0)","v":{"$error":"#N/A"}},{"$f":"VLOOKUP(A39,saisie!B$7:AL$26,21,0)","v":{"$error":"#N/A"}},{"$f":"VLOOKUP(A39,saisie!B$7:AL$26,22,0)","v":{"$error":"#N/A"}},{"$f":"VLOOKUP(A39,saisie!B$7:AL$26,23,0)","v":{"$error":"#N/A"}},{"$f":"VLOOKUP(A39,saisie!B$7:AL$26,24,0)","v":{"$error":"#N/A"}},{"$f":"VLOOKUP(A39,saisie!B$7:AL$26,25,0)","v":{"$error":"#N/A"}},{"$f":"VLOOKUP(A39,saisie!B$7:AL$26,26,0)","v":{"$error":"#N/A"}},{"$f":"VLOOKUP(A39,saisie!B$7:AL$26,27,0)","v":{"$error":"#N/A"}},{"$f":"VLOOKUP(A39,saisie!B$7:AL$26,28,0)","v":{"$error":"#N/A"}},{"$f":"VLOOKUP(A39,saisie!B$7:AL$26,29,0)","v":{"$error":"#N/A"}},{"$f":"VLOOKUP(A39,saisie!B$7:AL$26,30,0)","v":{"$error":"#N/A"}},{"$f":"VLOOKUP(A39,saisie!B$7:AL$26,31,0)","v":{"$error":"#N/A"}},{"$f":"VLOOKUP(A39,saisie!B$7:AL$26,32,0)","v":{"$error":"#N/A"}},{"$f":"VLOOKUP(A39,saisie!B$7:AL$26,33,0)","v":{"$error":"#N/A"}},{"$f":"VLOOKUP(A39,saisie!B$7:AL$26,34,0)","v":{"$error":"#N/A"}},{"$f":"VLOOKUP(A39,saisie!B$7:AL$26,35,0)","v":{"$error":"#N/A"}}]
[{"$f":"IF(INFO!B8>33,34,\"\")","v":""},{"$f":"VLOOKUP(A40,saisie!B$7:AL$26,2,0)","v":{"$error":"#N/A"}},{"$f":"VLOOKUP(A40,saisie!B$7:AL$26,3,0)","v":{"$error":"#N/A"}},{"$f":"VLOOKUP(A40,saisie!B$7:AL$26,4,0)","v":{"$error":"#N/A"}},{"$f":"VLOOKUP(A40,saisie!B$7:AL$26,5,0)","v":{"$error":"#N/A"}},{"$f":"VLOOKUP(A40,saisie!B$7:AL$26,6,0)","v":{"$error":"#N/A"}},{"$f":"VLOOKUP(A40,saisie!B$7:AL$26,7,0)","v":{"$error":"#N/A"}},{"$f":"VLOOKUP(A40,saisie!B$7:AL$26,8,0)","v":{"$error":"#N/A"}},{"$f":"VLOOKUP(A40,saisie!B$7:AL$26,9,0)","v":{"$error":"#N/A"}},{"$f":"VLOOKUP(A40,saisie!B$7:AL$26,10,0)","v":{"$error":"#N/A"}},{"$f":"VLOOKUP(A40,saisie!B$7:AL$26,11,0)","v":{"$error":"#N/A"}},{"$f":"VLOOKUP(A40,saisie!B$7:AL$26,12,0)","v":{"$error":"#N/A"}},{"$f":"VLOOKUP(A40,saisie!B$7:AL$26,13,0)","v":{"$error":"#N/A"}},{"$f":"VLOOKUP(A40,saisie!B$7:AL$26,14,0)","v":{"$error":"#N/A"}},{"$f":"VLOOKUP(A40,saisie!B$7:AL$26,15,0)","v":{"$error":"#N/A"}},{"$f":"VLOOKUP(A40,saisie!B$7:AL$26,16,0)","v":{"$error":"#N/A"}},{"$f":"VLOOKUP(A40,saisie!B$7:AL$26,17,0)","v":{"$error":"#N/A"}},{"$f":"VLOOKUP(A40,saisie!B$7:AL$26,18,0)","v":{"$error":"#N/A"}},{"$f":"VLOOKUP(A40,saisie!B$7:AL$26,19,0)","v":{"$error":"#N/A"}},{"$f":"VLOOKUP(A40,saisie!B$7:AL$26,20,0)","v":{"$error":"#N/A"}},{"$f":"VLOOKUP(A40,saisie!B$7:AL$26,21,0)","v":{"$error":"#N/A"}},{"$f":"VLOOKUP(A40,saisie!B$7:AL$26,22,0)","v":{"$error":"#N/A"}},{"$f":"VLOOKUP(A40,saisie!B$7:AL$26,23,0)","v":{"$error":"#N/A"}},{"$f":"VLOOKUP(A40,saisie!B$7:AL$26,24,0)","v":{"$error":"#N/A"}},{"$f":"VLOOKUP(A40,saisie!B$7:AL$26,25,0)","v":{"$error":"#N/A"}},{"$f":"VLOOKUP(A40,saisie!B$7:AL$26,26,0)","v":{"$error":"#N/A"}},{"$f":"VLOOKUP(A40,saisie!B$7:AL$26,27,0)","v":{"$error":"#N/A"}},{"$f":"VLOOKUP(A40,saisie!B$7:AL$26,28,0)","v":{"$error":"#N/A"}},{"$f":"VLOOKUP(A40,saisie!B$7:AL$26,29,0)","v":{"$error":"#N/A"}},{"$f":"VLOOKUP(A40,saisie!B$7:AL$26,30,0)","v":{"$error":"#N/A"}},{"$f":"VLOOKUP(A40,saisie!B$7:AL$26,31,0)","v":{"$error":"#N/A"}},{"$f":"VLOOKUP(A40,saisie!B$7:AL$26,32,0)","v":{"$error":"#N/A"}},{"$f":"VLOOKUP(A40,saisie!B$7:AL$26,33,0)","v":{"$error":"#N/A"}},{"$f":"VLOOKUP(A40,saisie!B$7:AL$26,34,0)","v":{"$error":"#N/A"}},{"$f":"VLOOKUP(A40,saisie!B$7:AL$26,35,0)","v":{"$error":"#N/A"}}]
[{"$f":"IF(INFO!B8>34,35,\"\")","v":""},{"$f":"VLOOKUP(A41,saisie!B$7:AL$26,2,0)","v":{"$error":"#N/A"}},{"$f":"VLOOKUP(A41,saisie!B$7:AL$26,3,0)","v":{"$error":"#N/A"}},{"$f":"VLOOKUP(A41,saisie!B$7:AL$26,4,0)","v":{"$error":"#N/A"}},{"$f":"VLOOKUP(A41,saisie!B$7:AL$26,5,0)","v":{"$error":"#N/A"}},{"$f":"VLOOKUP(A41,saisie!B$7:AL$26,6,0)","v":{"$error":"#N/A"}},{"$f":"VLOOKUP(A41,saisie!B$7:AL$26,7,0)","v":{"$error":"#N/A"}},{"$f":"VLOOKUP(A41,saisie!B$7:AL$26,8,0)","v":{"$error":"#N/A"}},{"$f":"VLOOKUP(A41,saisie!B$7:AL$26,9,0)","v":{"$error":"#N/A"}},{"$f":"VLOOKUP(A41,saisie!B$7:AL$26,10,0)","v":{"$error":"#N/A"}},{"$f":"VLOOKUP(A41,saisie!B$7:AL$26,11,0)","v":{"$error":"#N/A"}},{"$f":"VLOOKUP(A41,saisie!B$7:AL$26,12,0)","v":{"$error":"#N/A"}},{"$f":"VLOOKUP(A41,saisie!B$7:AL$26,13,0)","v":{"$error":"#N/A"}},{"$f":"VLOOKUP(A41,saisie!B$7:AL$26,14,0)","v":{"$error":"#N/A"}},{"$f":"VLOOKUP(A41,saisie!B$7:AL$26,15,0)","v":{"$error":"#N/A"}},{"$f":"VLOOKUP(A41,saisie!B$7:AL$26,16,0)","v":{"$error":"#N/A"}},{"$f":"VLOOKUP(A41,saisie!B$7:AL$26,17,0)","v":{"$error":"#N/A"}},{"$f":"VLOOKUP(A41,saisie!B$7:AL$26,18,0)","v":{"$error":"#N/A"}},{"$f":"VLOOKUP(A41,saisie!B$7:AL$26,19,0)","v":{"$error":"#N/A"}},{"$f":"VLOOKUP(A41,saisie!B$7:AL$26,20,0)","v":{"$error":"#N/A"}},{"$f":"VLOOKUP(A41,saisie!B$7:AL$26,21,0)","v":{"$error":"#N/A"}},{"$f":"VLOOKUP(A41,saisie!B$7:AL$26,22,0)","v":{"$error":"#N/A"}},{"$f":"VLOOKUP(A41,saisie!B$7:AL$26,23,0)","v":{"$error":"#N/A"}},{"$f":"VLOOKUP(A41,saisie!B$7:AL$26,24,0)","v":{"$error":"#N/A"}},{"$f":"VLOOKUP(A41,saisie!B$7:AL$26,25,0)","v":{"$error":"#N/A"}},{"$f":"VLOOKUP(A41,saisie!B$7:AL$26,26,0)","v":{"$error":"#N/A"}},{"$f":"VLOOKUP(A41,saisie!B$7:AL$26,27,0)","v":{"$error":"#N/A"}},{"$f":"VLOOKUP(A41,saisie!B$7:AL$26,28,0)","v":{"$error":"#N/A"}},{"$f":"VLOOKUP(A41,saisie!B$7:AL$26,29,0)","v":{"$error":"#N/A"}},{"$f":"VLOOKUP(A41,saisie!B$7:AL$26,30,0)","v":{"$error":"#N/A"}},{"$f":"VLOOKUP(A41,saisie!B$7:AL$26,31,0)","v":{"$error":"#N/A"}},{"$f":"VLOOKUP(A41,saisie!B$7:AL$26,32,0)","v":{"$error":"#N/A"}},{"$f":"VLOOKUP(A41,saisie!B$7:AL$26,33,0)","v":{"$error":"#N/A"}},{"$f":"VLOOKUP(A41,saisie!B$7:AL$26,34,0)","v":{"$error":"#N/A"}},{"$f":"VLOOKUP(A41,saisie!B$7:AL$26,35,0)","v":{"$error":"#N/A"}}]
[{"$f":"IF(INFO!B8>35,36,\"\")","v":""},{"$f":"VLOOKUP(A42,saisie!B$7:AL$26,2,0)","v":{"$error":"#N/A"}},{"$f":"VLOOKUP(A42,saisie!B$7:AL$26,3,0)","v":{"$error":"#N/A"}},{"$f":"VLOOKUP(A42,saisie!B$7:AL$26,4,0)","v":{"$error":"#N/A"}},{"$f":"VLOOKUP(A42,saisie!B$7:AL$26,5,0)","v":{"$error":"#N/A"}},{"$f":"VLOOKUP(A42,saisie!B$7:AL$26,6,0)","v":{"$error":"#N/A"}},{"$f":"VLOOKUP(A42,saisie!B$7:AL$26,7,0)","v":{"$error":"#N/A"}},{"$f":"VLOOKUP(A42,saisie!B$7:AL$26,8,0)","v":{"$error":"#N/A"}},{"$f":"VLOOKUP(A42,saisie!B$7:AL$26,9,0)","v":{"$error":"#N/A"}},{"$f":"VLOOKUP(A42,saisie!B$7:AL$26,10,0)","v":{"$error":"#N/A"}},{"$f":"VLOOKUP(A42,saisie!B$7:AL$26,11,0)","v":{"$error":"#N/A"}},{"$f":"VLOOKUP(A42,saisie!B$7:AL$26,12,0)","v":{"$error":"#N/A"}},{"$f":"VLOOKUP(A42,saisie!B$7:AL$26,13,0)","v":{"$error":"#N/A"}},{"$f":"VLOOKUP(A42,saisie!B$7:AL$26,14,0)","v":{"$error":"#N/A"}},{"$f":"VLOOKUP(A42,saisie!B$7:AL$26,15,0)","v":{"$error":"#N/A"}},{"$f":"VLOOKUP(A42,saisie!B$7:AL$26,16,0)","v":{"$error":"#N/A"}},{"$f":"VLOOKUP(A42,saisie!B$7:AL$26,17,0)","v":{"$error":"#N/A"}},{"$f":"VLOOKUP(A42,saisie!B$7:AL$26,18,0)","v":{"$error":"#N/A"}},{"$f":"VLOOKUP(A42,saisie!B$7:AL$26,19,0)","v":{"$error":"#N/A"}},{"$f":"VLOOKUP(A42,saisie!B$7:AL$26,20,0)","v":{"$error":"#N/A"}},{"$f":"VLOOKUP(A42,saisie!B$7:AL$26,21,0)","v":{"$error":"#N/A"}},{"$f":"VLOOKUP(A42,saisie!B$7:AL$26,22,0)","v":{"$error":"#N/A"}},{"$f":"VLOOKUP(A42,saisie!B$7:AL$26,23,0)","v":{"$error":"#N/A"}},{"$f":"VLOOKUP(A42,saisie!B$7:AL$26,24,0)","v":{"$error":"#N/A"}},{"$f":"VLOOKUP(A42,saisie!B$7:AL$26,25,0)","v":{"$error":"#N/A"}},{"$f":"VLOOKUP(A42,saisie!B$7:AL$26,26,0)","v":{"$error":"#N/A"}},{"$f":"VLOOKUP(A42,saisie!B$7:AL$26,27,0)","v":{"$error":"#N/A"}},{"$f":"VLOOKUP(A42,saisie!B$7:AL$26,28,0)","v":{"$error":"#N/A"}},{"$f":"VLOOKUP(A42,saisie!B$7:AL$26,29,0)","v":{"$error":"#N/A"}},{"$f":"VLOOKUP(A42,saisie!B$7:AL$26,30,0)","v":{"$error":"#N/A"}},{"$f":"VLOOKUP(A42,saisie!B$7:AL$26,31,0)","v":{"$error":"#N/A"}},{"$f":"VLOOKUP(A42,saisie!B$7:AL$26,32,0)","v":{"$error":"#N/A"}},{"$f":"VLOOKUP(A42,saisie!B$7:AL$26,33,0)","v":{"$error":"#N/A"}},{"$f":"VLOOKUP(A42,saisie!B$7:AL$26,34,0)","v":{"$error":"#N/A"}},{"$f":"VLOOKUP(A42,saisie!B$7:AL$26,35,0)","v":{"$error":"#N/A"}}]
[{"$f":"IF(INFO!B8>36,37,\"\")","v":""},{"$f":"VLOOKUP(A43,saisie!B$7:AL$26,2,0)","v":{"$error":"#N/A"}},{"$f":"VLOOKUP(A43,saisie!B$7:AL$26,3,0)","v":{"$error":"#N/A"}},{"$f":"VLOOKUP(A43,saisie!B$7:AL$26,4,0)","v":{"$error":"#N/A"}},{"$f":"VLOOKUP(A43,saisie!B$7:AL$26,5,0)","v":{"$error":"#N/A"}},{"$f":"VLOOKUP(A43,saisie!B$7:AL$26,6,0)","v":{"$error":"#N/A"}},{"$f":"VLOOKUP(A43,saisie!B$7:AL$26,7,0)","v":{"$error":"#N/A"}},{"$f":"VLOOKUP(A43,saisie!B$7:AL$26,8,0)","v":{"$error":"#N/A"}},{"$f":"VLOOKUP(A43,saisie!B$7:AL$26,9,0)","v":{"$error":"#N/A"}},{"$f":"VLOOKUP(A43,saisie!B$7:AL$26,10,0)","v":{"$error":"#N/A"}},{"$f":"VLOOKUP(A43,saisie!B$7:AL$26,11,0)","v":{"$error":"#N/A"}},{"$f":"VLOOKUP(A43,saisie!B$7:AL$26,12,0)","v":{"$error":"#N/A"}},{"$f":"VLOOKUP(A43,saisie!B$7:AL$26,13,0)","v":{"$error":"#N/A"}},{"$f":"VLOOKUP(A43,saisie!B$7:AL$26,14,0)","v":{"$error":"#N/A"}},{"$f":"VLOOKUP(A43,saisie!B$7:AL$26,15,0)","v":{"$error":"#N/A"}},{"$f":"VLOOKUP(A43,saisie!B$7:AL$26,16,0)","v":{"$error":"#N/A"}},{"$f":"VLOOKUP(A43,saisie!B$7:AL$26,17,0)","v":{"$error":"#N/A"}},{"$f":"VLOOKUP(A43,saisie!B$7:AL$26,18,0)","v":{"$error":"#N/A"}},{"$f":"VLOOKUP(A43,saisie!B$7:AL$26,19,0)","v":{"$error":"#N/A"}},{"$f":"VLOOKUP(A43,saisie!B$7:AL$26,20,0)","v":{"$error":"#N/A"}},{"$f":"VLOOKUP(A43,saisie!B$7:AL$26,21,0)","v":{"$error":"#N/A"}},{"$f":"VLOOKUP(A43,saisie!B$7:AL$26,22,0)","v":{"$error":"#N/A"}},{"$f":"VLOOKUP(A43,saisie!B$7:AL$26,23,0)","v":{"$error":"#N/A"}},{"$f":"VLOOKUP(A43,saisie!B$7:AL$26,24,0)","v":{"$error":"#N/A"}},{"$f":"VLOOKUP(A43,saisie!B$7:AL$26,25,0)","v":{"$error":"#N/A"}},{"$f":"VLOOKUP(A43,saisie!B$7:AL$26,26,0)","v":{"$error":"#N/A"}},{"$f":"VLOOKUP(A43,saisie!B$7:AL$26,27,0)","v":{"$error":"#N/A"}},{"$f":"VLOOKUP(A43,saisie!B$7:AL$26,28,0)","v":{"$error":"#N/A"}},{"$f":"VLOOKUP(A43,saisie!B$7:AL$26,29,0)","v":{"$error":"#N/A"}},{"$f":"VLOOKUP(A43,saisie!B$7:AL$26,30,0)","v":{"$error":"#N/A"}},{"$f":"VLOOKUP(A43,saisie!B$7:AL$26,31,0)","v":{"$error":"#N/A"}},{"$f":"VLOOKUP(A43,saisie!B$7:AL$26,32,0)","v":{"$error":"#N/A"}},{"$f":"VLOOKUP(A43,saisie!B$7:AL$26,33,0)","v":{"$error":"#N/A"}},{"$f":"VLOOKUP(A43,saisie!B$7:AL$26,34,0)","v":{"$error":"#N/A"}},{"$f":"VLOOKUP(A43,saisie!B$7:AL$26,35,0)","v":{"$error":"#N/A"}}]
[{"$f":"IF(INFO!B8>37,38,\"\")","v":""},{"$f":"VLOOKUP(A44,saisie!B$7:AL$26,2,0)","v":{"$error":"#N/A"}},{"$f":"VLOOKUP(A44,saisie!B$7:AL$26,3,0)","v":{"$error":"#N/A"}},{"$f":"VLOOKUP(A44,saisie!B$7:AL$26,4,0)","v":{"$error":"#N/A"}},{"$f":"VLOOKUP(A44,saisie!B$7:AL$26,5,0)","v":{"$error":"#N/A"}},{"$f":"VLOOKUP(A44,saisie!B$7:AL$26,6,0)","v":{"$error":"#N/A"}},{"$f":"VLOOKUP(A44,saisie!B$7:AL$26,7,0)","v":{"$error":"#N/A"}},{"$f":"VLOOKUP(A44,saisie!B$7:AL$26,8,0)","v":{"$error":"#N/A"}},{"$f":"VLOOKUP(A44,saisie!B$7:AL$26,9,0)","v":{"$error":"#N/A"}},{"$f":"VLOOKUP(A44,saisie!B$7:AL$26,10,0)","v":{"$error":"#N/A"}},{"$f":"VLOOKUP(A44,saisie!B$7:AL$26,11,0)","v":{"$error":"#N/A"}},{"$f":"VLOOKUP(A44,saisie!B$7:AL$26,12,0)","v":{"$error":"#N/A"}},{"$f":"VLOOKUP(A44,saisie!B$7:AL$26,13,0)","v":{"$error":"#N/A"}},{"$f":"VLOOKUP(A44,saisie!B$7:AL$26,14,0)","v":{"$error":"#N/A"}},{"$f":"VLOOKUP(A44,saisie!B$7:AL$26,15,0)","v":{"$error":"#N/A"}},{"$f":"VLOOKUP(A44,saisie!B$7:AL$26,16,0)","v":{"$error":"#N/A"}},{"$f":"VLOOKUP(A44,saisie!B$7:AL$26,17,0)","v":{"$error":"#N/A"}},{"$f":"VLOOKUP(A44,saisie!B$7:AL$26,18,0)","v":{"$error":"#N/A"}},{"$f":"VLOOKUP(A44,saisie!B$7:AL$26,19,0)","v":{"$error":"#N/A"}},{"$f":"VLOOKUP(A44,saisie!B$7:AL$26,20,0)","v":{"$error":"#N/A"}},{"$f":"VLOOKUP(A44,saisie!B$7:AL$26,21,0)","v":{"$error":"#N/A"}},{"$f":"VLOOKUP(A44,saisie!B$7:AL$26,22,0)","v":{"$error":"#N/A"}},{"$f":"VLOOKUP(A44,saisie!B$7:AL$26,23,0)","v":{"$error":"#N/A"}},{"$f":"VLOOKUP(A44,saisie!B$7:AL$26,24,0)","v":{"$error":"#N/A"}},{"$f":"VLOOKUP(A44,saisie!B$7:AL$26,25,0)","v":{"$error":"#N/A"}},{"$f":"VLOOKUP(A44,saisie!B$7:AL$26,26,0)","v":{"$error":"#N/A"}},{"$f":"VLOOKUP(A44,saisie!B$7:AL$26,27,0)","v":{"$error":"#N/A"}},{"$f":"VLOOKUP(A44,saisie!B$7:AL$26,28,0)","v":{"$error":"#N/A"}},{"$f":"VLOOKUP(A44,saisie!B$7:AL$26,29,0)","v":{"$error":"#N/A"}},{"$f":"VLOOKUP(A44,saisie!B$7:AL$26,30,0)","v":{"$error":"#N/A"}},{"$f":"VLOOKUP(A44,saisie!B$7:AL$26,31,0)","v":{"$error":"#N/A"}},{"$f":"VLOOKUP(A44,saisie!B$7:AL$26,32,0)","v":{"$error":"#N/A"}},{"$f":"VLOOKUP(A44,saisie!B$7:AL$26,33,0)","v":{"$error":"#N/A"}},{"$f":"VLOOKUP(A44,saisie!B$7:AL$26,34,0)","v":{"$error":"#N/A"}},{"$f":"VLOOKUP(A44,saisie!B$7:AL$26,35,0)","v":{"$error":"#N/A"}}]
[{"$f":"IF(INFO!B8>38,39,\"\")","v":""},{"$f":"VLOOKUP(A45,saisie!B$7:AL$26,2,0)","v":{"$error":"#N/A"}},{"$f":"VLOOKUP(A45,saisie!B$7:AL$26,3,0)","v":{"$error":"#N/A"}},{"$f":"VLOOKUP(A45,saisie!B$7:AL$26,4,0)","v":{"$error":"#N/A"}},{"$f":"VLOOKUP(A45,saisie!B$7:AL$26,5,0)","v":{"$error":"#N/A"}},{"$f":"VLOOKUP(A45,saisie!B$7:AL$26,6,0)","v":{"$error":"#N/A"}},{"$f":"VLOOKUP(A45,saisie!B$7:AL$26,7,0)","v":{"$error":"#N/A"}},{"$f":"VLOOKUP(A45,saisie!B$7:AL$26,8,0)","v":{"$error":"#N/A"}},{"$f":"VLOOKUP(A45,saisie!B$7:AL$26,9,0)","v":{"$error":"#N/A"}},{"$f":"VLOOKUP(A45,saisie!B$7:AL$26,10,0)","v":{"$error":"#N/A"}},{"$f":"VLOOKUP(A45,saisie!B$7:AL$26,11,0)","v":{"$error":"#N/A"}},{"$f":"VLOOKUP(A45,saisie!B$7:AL$26,12,0)","v":{"$error":"#N/A"}},{"$f":"VLOOKUP(A45,saisie!B$7:AL$26,13,0)","v":{"$error":"#N/A"}},{"$f":"VLOOKUP(A45,saisie!B$7:AL$26,14,0)","v":{"$error":"#N/A"}},{"$f":"VLOOKUP(A45,saisie!B$7:AL$26,15,0)","v":{"$error":"#N/A"}},{"$f":"VLOOKUP(A45,saisie!B$7:AL$26,16,0)","v":{"$error":"#N/A"}},{"$f":"VLOOKUP(A45,saisie!B$7:AL$26,17,0)","v":{"$error":"#N/A"}},{"$f":"VLOOKUP(A45,saisie!B$7:AL$26,18,0)","v":{"$error":"#N/A"}},{"$f":"VLOOKUP(A45,saisie!B$7:AL$26,19,0)","v":{"$error":"#N/A"}},{"$f":"VLOOKUP(A45,saisie!B$7:AL$26,20,0)","v":{"$error":"#N/A"}},{"$f":"VLOOKUP(A45,saisie!B$7:AL$26,21,0)","v":{"$error":"#N/A"}},{"$f":"VLOOKUP(A45,saisie!B$7:AL$26,22,0)","v":{"$error":"#N/A"}},{"$f":"VLOOKUP(A45,saisie!B$7:AL$26,23,0)","v":{"$error":"#N/A"}},{"$f":"VLOOKUP(A45,saisie!B$7:AL$26,24,0)","v":{"$error":"#N/A"}},{"$f":"VLOOKUP(A45,saisie!B$7:AL$26,25,0)","v":{"$error":"#N/A"}},{"$f":"VLOOKUP(A45,saisie!B$7:AL$26,26,0)","v":{"$error":"#N/A"}},{"$f":"VLOOKUP(A45,saisie!B$7:AL$26,27,0)","v":{"$error":"#N/A"}},{"$f":"VLOOKUP(A45,saisie!B$7:AL$26,28,0)","v":{"$error":"#N/A"}},{"$f":"VLOOKUP(A45,saisie!B$7:AL$26,29,0)","v":{"$error":"#N/A"}},{"$f":"VLOOKUP(A45,saisie!B$7:AL$26,30,0)","v":{"$error":"#N/A"}},{"$f":"VLOOKUP(A45,saisie!B$7:AL$26,31,0)","v":{"$error":"#N/A"}},{"$f":"VLOOKUP(A45,saisie!B$7:AL$26,32,0)","v":{"$error":"#N/A"}},{"$f":"VLOOKUP(A45,saisie!B$7:AL$26,33,0)","v":{"$error":"#N/A"}},{"$f":"VLOOKUP(A45,saisie!B$7:AL$26,34,0)","v":{"$error":"#N/A"}},{"$f":"VLOOKUP(A45,saisie!B$7:AL$26,35,0)","v":{"$error":"#N/A"}}]
[{"$f":"IF(INFO!B8>39,40,\"\")","v":""},{"$f":"VLOOKUP(A46,saisie!B$7:AL$26,2,0)","v":{"$error":"#N/A"}},{"$f":"VLOOKUP(A46,saisie!B$7:AL$26,3,0)","v":{"$error":"#N/A"}},{"$f":"VLOOKUP(A46,saisie!B$7:AL$26,4,0)","v":{"$error":"#N/A"}},{"$f":"VLOOKUP(A46,saisie!B$7:AL$26,5,0)","v":{"$error":"#N/A"}},{"$f":"VLOOKUP(A46,saisie!B$7:AL$26,6,0)","v":{"$error":"#N/A"}},{"$f":"VLOOKUP(A46,saisie!B$7:AL$26,7,0)","v":{"$error":"#N/A"}},{"$f":"VLOOKUP(A46,saisie!B$7:AL$26,8,0)","v":{"$error":"#N/A"}},{"$f":"VLOOKUP(A46,saisie!B$7:AL$26,9,0)","v":{"$error":"#N/A"}},{"$f":"VLOOKUP(A46,saisie!B$7:AL$26,10,0)","v":{"$error":"#N/A"}},{"$f":"VLOOKUP(A46,saisie!B$7:AL$26,11,0)","v":{"$error":"#N/A"}},{"$f":"VLOOKUP(A46,saisie!B$7:AL$26,12,0)","v":{"$error":"#N/A"}},{"$f":"VLOOKUP(A46,saisie!B$7:AL$26,13,0)","v":{"$error":"#N/A"}},{"$f":"VLOOKUP(A46,saisie!B$7:AL$26,14,0)","v":{"$error":"#N/A"}},{"$f":"VLOOKUP(A46,saisie!B$7:AL$26,15,0)","v":{"$error":"#N/A"}},{"$f":"VLOOKUP(A46,saisie!B$7:AL$26,16,0)","v":{"$error":"#N/A"}},{"$f":"VLOOKUP(A46,saisie!B$7:AL$26,17,0)","v":{"$error":"#N/A"}},{"$f":"VLOOKUP(A46,saisie!B$7:AL$26,18,0)","v":{"$error":"#N/A"}},{"$f":"VLOOKUP(A46,saisie!B$7:AL$26,19,0)","v":{"$error":"#N/A"}},{"$f":"VLOOKUP(A46,saisie!B$7:AL$26,20,0)","v":{"$error":"#N/A"}},{"$f":"VLOOKUP(A46,saisie!B$7:AL$26,21,0)","v":{"$error":"#N/A"}},{"$f":"VLOOKUP(A46,saisie!B$7:AL$26,22,0)","v":{"$error":"#N/A"}},{"$f":"VLOOKUP(A46,saisie!B$7:AL$26,23,0)","v":{"$error":"#N/A"}},{"$f":"VLOOKUP(A46,saisie!B$7:AL$26,24,0)","v":{"$error":"#N/A"}},{"$f":"VLOOKUP(A46,saisie!B$7:AL$26,25,0)","v":{"$error":"#N/A"}},{"$f":"VLOOKUP(A46,saisie!B$7:AL$26,26,0)","v":{"$error":"#N/A"}},{"$f":"VLOOKUP(A46,saisie!B$7:AL$26,27,0)","v":{"$error":"#N/A"}},{"$f":"VLOOKUP(A46,saisie!B$7:AL$26,28,0)","v":{"$error":"#N/A"}},{"$f":"VLOOKUP(A46,saisie!B$7:AL$26,29,0)","v":{"$error":"#N/A"}},{"$f":"VLOOKUP(A46,saisie!B$7:AL$26,30,0)","v":{"$error":"#N/A"}},{"$f":"VLOOKUP(A46,saisie!B$7:AL$26,31,0)","v":{"$error":"#N/A"}},{"$f":"VLOOKUP(A46,saisie!B$7:AL$26,32,0)","v":{"$error":"#N/A"}},{"$f":"VLOOKUP(A46,saisie!B$7:AL$26,33,0)","v":{"$error":"#N/A"}},{"$f":"VLOOKUP(A46,saisie!B$7:AL$26,34,0)","v":{"$error":"#N/A"}},{"$f":"VLOOKUP(A46,saisie!B$7:AL$26,35,0)","v":{"$error":"#N/A"}}]

{"sheet":"Clb Q (2)","index":3,"n_rows":31,"n_cols":15,"rows_kept":31,"cut":false,"hidden":true,"merged":[]}
[null,"CLUB N°1",{"$f":"'M Q'!B7","v":"ROCHEFORT   T.S.R"},null,null,{"$f":"'M Q'!AH7","v":1312},null,null,null,{"$f":"IF(INFO!B8>7,\"CLUB N°8\",\"\")","v":""},{"$f":"'M Q'!B14","v":{"$error":"#N/A"}},null,null,{"$f":"'M Q'!AH14","v":{"$error":"#N/A"}}]
[null,"NOMS","série 1","série 2","série 3","POINTS",null,null,null,"NOMS","série 1","série 2","série 3","POINTS"]
[{"$f":"F3+0.0001*G3+0.0000001*E3+0.0000000001*D3","v":267.00000880900001},{"$f":"'M Q'!D7","v":"BAUDET Philippe"},{"$f":"'M Q'!E7","v":89},{"$f":"'M Q'!F7","v":90},{"$f":"'M Q'!G7","v":88},{"$f":"'M Q'!H7","v":267},{"$f":"'M Q'!I7","v":0},null,{"$f":"N3+0.0001*O3+0.0000001*M3+0.0000000001*L3","v":{"$error":"#N/A"}},{"$f":"'M Q'!D14","v":{"$error":"#N/A"}},{"$f":"'M Q'!E14","v":{"$error":"#N/A"}},{"$f":"'M Q'!F14","v":{"$error":"#N/A"}},{"$f":"'M Q'!G14","v":{"$error":"#N/A"}},{"$f":"'M Q'!H14","v":{"$error":"#N/A"}},{"$f":"'M Q'!I14","v":{"$error":"#N/A"}}]
[{"$f":"F4+0.0001*G4+0.0000001*E4+0.0000000001*D4","v":281.00000950909998},{"$f":"'M Q'!J7","v":"BERGOGNE Cyril"},{"$f":"'M Q'!K7","v":95},{"$f":"'M Q'!L7","v":91},{"$f":"'M Q'!M7","v":95},{"$f":"'M Q'!N7","v":281},{"$f":"'M Q'!O7","v":0},null,{"$f":"N4+0.0001*O4+0.0000001*M4+0.0000000001*L4","v":{"$error":"#N/A"}},{"$f":"'M Q'!J14","v":{"$error":"#N/A"}},{"$f":"'M Q'!K14","v":{"$error":"#N/A"}},{"$f":"'M Q'!L14","v":{"$error":"#N/A"}},{"$f":"'M Q'!M14","v":{"$error":"#N/A"}},{"$f":"'M Q'!N14","v":{"$error":"#N/A"}},{"$f":"'M Q'!O14","v":{"$error":"#N/A"}}]
[{"$f":"F5+0.0001*G5+0.0000001*E5+0.0000000001*D5","v":261.00000860879999},{"$f":"'M Q'!P7","v":"MERCIER Rémy"},{"$f":"'M Q'!Q7","v":87},{"$f":"'M Q'!R7","v":88},{"$f":"'M Q'!S7","v":86},{"$f":"'M Q'!T7","v":261},{"$f":"'M Q'!U7","v":0},null,{"$f":"N5+0.0001*O5+0.0000001*M5+0.0000000001*L5","v":{"$error":"#N/A"}},{"$f":"'M Q'!P14","v":{"$error":"#N/A"}},{"$f":"'M Q'!Q14","v":{"$error":"#N/A"}},{"$f":"'M Q'!R14","v":{"$error":"#N/A"}},{"$f":"'M Q'!S14","v":{"$error":"#N/A"}},{"$f":"'M Q'!T14","v":{"$error":"#N/A"}},{"$f":"'M Q'!U14","v":{"$error":"#N/A"}}]
[{"$f":"F6+0.0001*G6+0.0000001*E6+0.0000000001*D6","v":234.00000770739999},{"$f":"'M Q'!V7","v":"BRIAND Ptrick"},{"$f":"'M Q'!W7","v":83},{"$f":"'M Q'!X7","v":74},{"$f":"'M Q'!Y7","v":77},{"$f":"'M Q'!Z7","v":234},{"$f":"'M Q'!AA7","v":0},null,{"$f":"N6+0.0001*O6+0.0000001*M6+0.0000000001*L6","v":{"$error":"#N/A"}},{"$f":"'M Q'!V14","v":{"$error":"#N/A"}},{"$f":"'M Q'!W14","v":{"$error":"#N/A"}},{"$f":"'M Q'!X14","v":{"$error":"#N/A"}},{"$f":"'M Q'!Y14","v":{"$error":"#N/A"}},{"$f":"'M Q'!Z14","v":{"$error":"#N/A"}},{"$f":"'M Q'!AA14","v":{"$error":"#N/A"}}]
[{"$f":"F7+0.0001*G7+0.0000001*E7+0.0000000001*D7","v":269.00000910900002},{"$f":"'M Q'!AB7","v":"MERCIER Mickael"},{"$f":"'M Q'!AC7","v":88},{"$f":"'M Q'!AD7","v":90},{"$f":"'M Q'!AE7","v":91},{"$f":"'M Q'!AF7","v":269},{"$f":"'M Q'!AG7","v":0},null,{"$f":"N7+0.0001*O7+0.0000001*M7+0.0000000001*L7","v":{"$error":"#N/A"}},{"$f":"'M Q'!AB14","v":{"$error":"#N/A"}},{"$f":"'M Q'!AC14","v":{"$error":"#N/A"}},{"$f":"'M Q'!AD14","v":{"$error":"#N/A"}},{"$f":"'M Q'!AE14","v":{"$error":"#N/A"}},{"$f":"'M Q'!AF14","v":{"$error":"#N/A"}},{"$f":"'M Q'!AG14","v":{"$error":"#N/A"}}]
[]
[null,"CLUB N°2",{"$f":"'M Q'!B8","v":"PONS   A.P.T.S"},null,null,{"$f":"'M Q'!AH8","v":1278},null,null,null,{"$f":"IF(INFO!B8>6,\"CLUB N°7\",\"\")","v":""},{"$f":"'M Q'!B13","v":{"$error":"#N/A"}},null,null,{"$f":"'M Q'!AH13","v":{"$error":"#N/A"}}]
[null,"NOMS","série 1","série 2","série 3","POINTS",null,null,null,"NOMS","série 1","série 2","série 3","POINTS"]
[{"$f":"F11+0.0001*G11+0.0000001*E11+0.0000000001*D11","v":237.00000750820001},{"$f":"'M Q'!D8","v":"DEBAIN Nathalie"},{"$f":"'M Q'!E8","v":80},{"$f":"'M Q'!F8","v":82},{"$f":"'M Q'!G8","v":75},{"$f":"'M Q'!H8","v":237},{"$f":"'M Q'!I8","v":0},null,{"$f":"N11+0.0001*O11+0.0000001*M11+0.0000000001*L11","v":{"$error":"#N/A"}},{"$f":"'M Q'!D13","v":{"$error":"#N/A"}},{"$f":"'M Q'!E13","v":{"$error":"#N/A"}},{"$f":"'M Q'!F13","v":{"$error":"#N/A"}},{"$f":"'M Q'!G13","v":{"$error":"#N/A"}},{"$f":"'M Q'!H13","v":{"$error":"#N/A"}},{"$f":"'M Q'!I13","v":{"$error":"#N/A"}}]
[{"$f":"F12+0.0001*G12+0.0000001*E12+0.0000000001*D12","v":257.00000920820003},{"$f":"'M Q'!J8","v":"ROUSSEAU Valérie"},{"$f":"'M Q'!K8","v":83},{"$f":"'M Q'!L8","v":82},{"$f":"'M Q'!M8","v":92},{"$f":"'M Q'!N8","v":257},{"$f":"'M Q'!O8","v":0},null,{"$f":"N12+0.0001*O12+0.0000001*M12+0.0000000001*L12","v":{"$error":"#N/A"}},{"$f":"'M Q'!J13","v":{"$error":"#N/A"}},{"$f":"'M Q'!K13","v":{"$error":"#N/A"}},{"$f":"'M Q'!L13","v":{"$error":"#N/A"}},{"$f":"'M Q'!M13","v":{"$error":"#N/A"}},{"$f":"'M Q'!N13","v":{"$error":"#N/A"}},{"$f":"'M Q'!O13","v":{"$error":"#N/A"}}]
[{"$f":"F13+0.0001*G13+0.0000001*E13+0.0000000001*D13","v":255.0000085083},{"$f":"'M Q'!P8","v":"ROUSSEAU Thierry"},{"$f":"'M Q'!Q8","v":87},{"$f":"'M Q'!R8","v":83},{"$f":"'M Q'!S8","v":85},{"$f":"'M Q'!T8","v":255},{"$f":"'M Q'!U8","v":0},null,{"$f":"N13+0.0001*O13+0.0000001*M13+0.0000000001*L13","v":{"$error":"#N/A"}},{"$f":"'M Q'!P13","v":{"$error":"#N/A"}},{"$f":"'M Q'!Q13","v":{"$error":"#N/A"}},{"$f":"'M Q'!R13","v":{"$error":"#N/A"}},{"$f":"'M Q'!S13","v":{"$error":"#N/A"}},{"$f":"'M Q'!T13","v":{"$error":"#N/A"}},{"$f":"'M Q'!U13","v":{"$error":"#N/A"}}]
[{"$f":"F14+0.0001*G14+0.0000001*E14+0.0000000001*D14","v":259.00000890860002},{"$f":"'M Q'!V8","v":"POULLY Pascal"},{"$f":"'M Q'!W8","v":84},{"$f":"'M Q'!X8","v":86},{"$f":"'M Q'!Y8","v":89},{"$f":"'M Q'!Z8","v":259},{"$f":"'M Q'!AA8","v":0},null,{"$f":"N14+0.0001*O14+0.0000001*M14+0.0000000001*L14","v":{"$error":"#N/A"}},{"$f":"'M Q'!V13","v":{"$error":"#N/A"}},{"$f":"'M Q'!W13","v":{"$error":"#N/A"}},{"$f":"'M Q'!X13","v":{"$error":"#N/A"}},{"$f":"'M Q'!Y13","v":{"$error":"#N/A"}},{"$f":"'M Q'!Z13","v":{"$error":"#N/A"}},{"$f":"'M Q'!AA13","v":{"$error":"#N/A"}}]
[{"$f":"F15+0.0001*G15+0.0000001*E15+0.0000000001*D15","v":270.00000910900002},{"$f":"'M Q'!AB8","v":"BERNARD Kevin"},{"$f":"'M Q'!AC8","v":89},{"$f":"'M Q'!AD8","v":90},{"$f":"'M Q'!AE8","v":91},{"$f":"'M Q'!AF8","v":270},{"$f":"'M Q'!AG8","v":0},null,{"$f":"N15+0.0001*O15+0.0000001*M15+0.0000000001*L15","v":{"$error":"#N/A"}},{"$f":"'M Q'!AB13","v":{"$error":"#N/A"}},{"$f":"'M Q'!AC13","v":{"$error":"#N/A"}},{"$f":"'M Q'!AD13","v":{"$error":"#N/A"}},{"$f":"'M Q'!AE13","v":{"$error":"#N/A"}},{"$f":"'M Q'!AF13","v":{"$error":"#N/A"}},{"$f":"'M Q'!AG13","v":{"$error":"#N/A"}}]
[]
[null,{"$f":"IF(INFO!B8>2,\"CLUB N°3\",\"\")","v":"CLUB N°3"},{"$f":"'M Q'!B9","v":"JONZAC   S.J.T"},null,null,{"$f":"'M Q'!AH9","v":1268},null,null,null,{"$f":"IF(INFO!B8>5,\"CLUB N°6\",\"\")","v":""},{"$f":"'M Q'!B12","v":{"$error":"#N/A"}},null,null,{"$f":"'M Q'!AH12","v":{"$error":"#N/A"}}]
[null,"NOMS","série 1","série 2","série 3","POINTS",null,null,null,"NOMS","série 1","série 2","série 3","POINTS"]
[{"$f":"F19+0.0001*G19+0.0000001*E19+0.0000000001*D19","v":247.00000830799999},{"$f":"'M Q'!D9","v":"GIOVANNONE Philippe"},{"$f":"'M Q'!E9","v":84},{"$f":"'M Q'!F9","v":80},{"$f":"'M Q'!G9","v":83},{"$f":"'M Q'!H9","v":247},{"$f":"'M Q'!I9","v":0},null,{"$f":"N19+0.0001*O19+0.0000001*M19+0.0000000001*L19","v":{"$error":"#N/A"}},{"$f":"'M Q'!D12","v":{"$error":"#N/A"}},{"$f":"'M Q'!E12","v":{"$error":"#N/A"}},{"$f":"'M Q'!F12","v":{"$error":"#N/A"}},{"$f":"'M Q'!G12","v":{"$error":"#N/A"}},{"$f":"'M Q'!H12","v":{"$error":"#N/A"}},{"$f":"'M Q'!I12","v":{"$error":"#N/A"}}]
[{"$f":"F20+0.0001*G20+0.0000001*E20+0.0000000001*D20","v":237.00000810750001},{"$f":"'M Q'!J9","v":"SOURIS Christine"},{"$f":"'M Q'!K9","v":81},{"$f":"'M Q'!L9","v":75},{"$f":"'M Q'!M9","v":81},{"$f":"'M Q'!N9","v":237},{"$f":"'M Q'!O9","v":0},null,{"$f":"N20+0.0001*O20+0.0000001*M20+0.0000000001*L20","v":{"$error":"#N/A"}},{"$f":"'M Q'!J12","v":{"$error":"#N/A"}},{"$f":"'M Q'!K12","v":{"$error":"#N/A"}},{"$f":"'M Q'!L12","v":{"$error":"#N/A"}},{"$f":"'M Q'!M12","v":{"$error":"#N/A"}},{"$f":"'M Q'!N12","v":{"$error":"#N/A"}},{"$f":"'M Q'!O12","v":{"$error":"#N/A"}}]
[{"$f":"F21+0.0001*G21+0.0000001*E21+0.0000000001*D21","v":272.00000880919998},{"$f":"'M Q'!P9","v":"ACHTOUK Kenza"},{"$f":"'M Q'!Q9","v":92},{"$f":"'M Q'!R9","v":92},{"$f":"'M Q'!S9","v":88},{"$f":"'M Q'!T9","v":272},{"$f":"'M Q'!U9","v":0},null,{"$f":"N21+0.0001*O21+0.0000001*M21+0.0000000001*L21","v":{"$error":"#N/A"}},{"$f":"'M Q'!P12","v":{"$error":"#N/A"}},{"$f":"'M Q'!Q12","v":{"$error":"#N/A"}},{"$f":"'M Q'!R12","v":{"$error":"#N/A"}},{"$f":"'M Q'!S12","v":{"$error":"#N/A"}},{"$f":"'M Q'!T12","v":{"$error":"#N/A"}},{"$f":"'M Q'!U12","v":{"$error":"#N/A"}}]
[{"$f":"F22+0.0001*G22+0.0000001*E22+0.0000000001*D22","v":250.0000089081},{"$f":"'M Q'!V9","v":"ARRIGONI Stéphane"},{"$f":"'M Q'!W9","v":80},{"$f":"'M Q'!X9","v":81},{"$f":"'M Q'!Y9","v":89},{"$f":"'M Q'!Z9","v":250},{"$f":"'M Q'!AA9","v":0},null,{"$f":"N22+0.0001*O22+0.0000001*M22+0.0000000001*L22","v":{"$error":"#N/A"}},{"$f":"'M Q'!V12","v":{"$error":"#N/A"}},{"$f":"'M Q'!W12","v":{"$error":"#N/A"}},{"$f":"'M Q'!X12","v":{"$error":"#N/A"}},{"$f":"'M Q'!Y12","v":{"$error":"#N/A"}},{"$f":"'M Q'!Z12","v":{"$error":"#N/A"}},{"$f":"'M Q'!AA12","v":{"$error":"#N/A"}}]
[{"$f":"F23+0.0001*G23+0.0000001*E23+0.0000000001*D23","v":262.00000830879998},{"$f":"'M Q'!AB9","v":"CORMELIER Hervé"},{"$f":"'M Q'!AC9","v":91},{"$f":"'M Q'!AD9","v":88},{"$f":"'M Q'!AE9","v":83},{"$f":"'M Q'!AF9","v":262},{"$f":"'M Q'!AG9","v":0},null,{"$f":"N23+0.0001*O23+0.0000001*M23+0.0000000001*L23","v":{"$error":"#N/A"}},{"$f":"'M Q'!AB12","v":{"$error":"#N/A"}},{"$f":"'M Q'!AC12","v":{"$error":"#N/A"}},{"$f":"'M Q'!AD12","v":{"$error":"#N/A"}},{"$f":"'M Q'!AE12","v":{"$error":"#N/A"}},{"$f":"'M Q'!AF12","v":{"$error":"#N/A"}},{"$f":"'M Q'!AG12","v":{"$error":"#N/A"}}]
[]
[null,{"$f":"IF(INFO!B8>3,\"CLUB N°4\",\"\")","v":"CLUB N°4"},{"$f":"'M Q'!B10","v":"SAINTES S.S.T"},null,null,{"$f":"'M Q'!AH10","v":1142},null,null,null,{"$f":"IF(INFO!B8>4,\"CLUB N°5\",\"\")","v":""},{"$f":"'M Q'!B11","v":{"$error":"#N/A"}},null,null,{"$f":"'M Q'!AH11","v":{"$error":"#N/A"}}]
[null,"NOMS","série 1","série 2","série 3","POINTS",null,null,null,"NOMS","série 1","série 2","série 3","POINTS"]
[{"$f":"F27+0.0001*G27+0.0000001*E27+0.0000000001*D27","v":265.00000880879998},{"$f":"'M Q'!D10","v":"JACQUES Christophe"},{"$f":"'M Q'!E10","v":89},{"$f":"'M Q'!F10","v":88},{"$f":"'M Q'!G10","v":88},{"$f":"'M Q'!H10","v":265},{"$f":"'M Q'!I10","v":0},null,{"$f":"N27+0.0001*O27+0.0000001*M27+0.0000000001*L27","v":{"$error":"#N/A"}},{"$f":"'M Q'!D11","v":{"$error":"#N/A"}},{"$f":"'M Q'!E11","v":{"$error":"#N/A"}},{"$f":"'M Q'!F11","v":{"$error":"#N/A"}},{"$f":"'M Q'!G11","v":{"$error":"#N/A"}},{"$f":"'M Q'!H11","v":{"$error":"#N/A"}},{"$f":"'M Q'!I11","v":{"$error":"#N/A"}}]
[{"$f":"F28+0.0001*G28+0.0000001*E28+0.0000000001*D28","v":131.0000033046},{"$f":"'M Q'!J10","v":"RABAT Catherine"},{"$f":"'M Q'!K10","v":52},{"$f":"'M Q'!L10","v":46},{"$f":"'M Q'!M10","v":33},{"$f":"'M Q'!N10","v":131},{"$f":"'M Q'!O10","v":0},null,{"$f":"N28+0.0001*O28+0.0000001*M28+0.0000000001*L28","v":{"$error":"#N/A"}},{"$f":"'M Q'!J11","v":{"$error":"#N/A"}},{"$f":"'M Q'!K11","v":{"$error":"#N/A"}},{"$f":"'M Q'!L11","v":{"$error":"#N/A"}},{"$f":"'M Q'!M11","v":{"$error":"#N/A"}},{"$f":"'M Q'!N11","v":{"$error":"#N/A"}},{"$f":"'M Q'!O11","v":{"$error":"#N/A"}}]
[{"$f":"F29+0.0001*G29+0.0000001*E29+0.0000000001*D29","v":248.0000083084},{"$f":"'M Q'!P10","v":"SOULIER Jean"},{"$f":"'M Q'!Q10","v":81},{"$f":"'M Q'!R10","v":84},{"$f":"'M Q'!S10","v":83},{"$f":"'M Q'!T10","v":248},{"$f":"'M Q'!U10","v":0},null,{"$f":"N29+0.0001*O29+0.0000001*M29+0.0000000001*L29","v":{"$error":"#N/A"}},{"$f":"'M Q'!P11","v":{"$error":"#N/A"}},{"$f":"'M Q'!Q11","v":{"$error":"#N/A"}},{"$f":"'M Q'!R11","v":{"$error":"#N/A"}},{"$f":"'M Q'!S11","v":{"$error":"#N/A"}},{"$f":"'M Q'!T11","v":{"$error":"#N/A"}},{"$f":"'M Q'!U11","v":{"$error":"#N/A"}}]
[{"$f":"F30+0.0001*G30+0.0000001*E30+0.0000000001*D30","v":225.00000790750002},{"$f":"'M Q'!V10","v":"BOIN Bertrand"},{"$f":"'M Q'!W10","v":71},{"$f":"'M Q'!X10","v":75},{"$f":"'M Q'!Y10","v":79},{"$f":"'M Q'!Z10","v":225},{"$f":"'M Q'!AA10","v":0},null,{"$f":"N30+0.0001*O30+0.0000001*M30+0.0000000001*L30","v":{"$error":"#N/A"}},{"$f":"'M Q'!V11","v":{"$error":"#N/A"}},{"$f":"'M Q'!W11","v":{"$error":"#N/A"}},{"$f":"'M Q'!X11","v":{"$error":"#N/A"}},{"$f":"'M Q'!Y11","v":{"$error":"#N/A"}},{"$f":"'M Q'!Z11","v":{"$error":"#N/A"}},{"$f":"'M Q'!AA11","v":{"$error":"#N/A"}}]
[{"$f":"F31+0.0001*G31+0.0000001*E31+0.0000000001*D31","v":273.00000910900002},{"$f":"'M Q'!AB10","v":"FLEURET Eric"},{"$f":"'M Q'!AC10","v":92},{"$f":"'M Q'!AD10","v":90},{"$f":"'M Q'!AE10","v":91},{"$f":"'M Q'!AF10","v":273},{"$f":"'M Q'!AG10","v":0},null,{"$f":"N31+0.0001*O31+0.0000001*M31+0.0000000001*L31","v":{"$error":"#N/A"}},{"$f":"'M Q'!AB11","v":{"$error":"#N/A"}},{"$f":"'M Q'!AC11","v":{"$error":"#N/A"}},{"$f":"'M Q'!AD11","v":{"$error":"#N/A"}},{"$f":"'M Q'!AE11","v":{"$error":"#N/A"}},{"$f":"'M Q'!AF11","v":{"$error":"#N/A"}},{"$f":"'M Q'!AG11","v":{"$error":"#N/A"}}]

{"sheet":"Clb Q","index":4,"n_rows":32,"n_cols":12,"rows_kept":32,"cut":false,"hidden":false,"merged":[[0,1,0,11],[25,2,25,4],[25,8,25,10],[17,2,17,4],[17,8,17,10],[1,2,1,4],[1,8,1,10],[9,2,9,4],[9,8,9,10]]}
[null,"CLUBS QUALIFIES EN PHASE FINALE"]
[null,"CLUB N°1",{"$f":"'Clb Q (2)'!C1","v":"ROCHEFORT   T.S.R"},null,null,{"$f":"'Clb Q (2)'!F1","v":1312},null,{"$f":"IF(INFO!B8>7,\"CLUB N°8\",\"\")","v":""},{"$f":"IF(INFO!B8>7,'Clb Q (2)'!K1,\"\")","v":""},null,null,{"$f":"IF(INFO!B8>7,'Clb Q (2)'!N1,\"\")","v":""}]
[null,"NOMS","série 1","série 2","série 3","POINTS",null,"NOMS","série 1","série 2","série 3","POINTS"]
[null,{"$f":"VLOOKUP(F4,'Clb Q (2)'!A$3:G$7,2,0)","v":"BERGOGNE Cyril"},{"$f":"VLOOKUP(F4,'Clb Q (2)'!A$3:G$7,3,0)","v":95},{"$f":"VLOOKUP(F4,'Clb Q (2)'!A$3:G$7,4,0)","v":91},{"$f":"VLOOKUP(F4,'Clb Q (2)'!A$3:G$7,5,0)","v":95},{"$f":"LARGE('Clb Q (2)'!A$3:A$7,1)","v":281.00000950909998},null,{"$f":"IF(INFO!B$8>7,VLOOKUP(L4,'Clb Q (2)'!I$3:O$7,2,0),\"\")","v":""},{"$f":"IF(INFO!B$8>7,VLOOKUP(L4,'Clb Q (2)'!I$3:O$7,3,0),\"\")","v":""},{"$f":"IF(INFO!B$8>7,VLOOKUP(L4,'Clb Q (2)'!I$3:O$7,4,0),\"\")","v":""},{"$f":"IF(INFO!B$8>7,VLOOKUP(L4,'Clb Q (2)'!I$3:O$7,5,0),\"\")","v":""},{"$f":"IF(INFO!B$8>7,LARGE('Clb Q (2)'!I$3:I$7,1),\"\")","v":""}]
[null,{"$f":"VLOOKUP(F5,'Clb Q (2)'!A$3:G$7,2,0)","v":"MERCIER Mickael"},{"$f":"VLOOKUP(F5,'Clb Q (2)'!A$3:G$7,3,0)","v":88},{"$f":"VLOOKUP(F5,'Clb Q (2)'!A$3:G$7,4,0)","v":90},{"$f":"VLOOKUP(F5,'Clb Q (2)'!A$3:G$7,5,0)","v":91},{"$f":"LARGE('Clb Q (2)'!A$3:A$7,2)","v":269.00000910900002},null,{"$f":"IF(INFO!B$8>7,VLOOKUP(L5,'Clb Q (2)'!I$3:O$7,2,0),\"\")","v":""},{"$f":"IF(INFO!B$8>7,VLOOKUP(L5,'Clb Q (2)'!I$3:O$7,3,0),\"\")","v":""},{"$f":"IF(INFO!B$8>7,VLOOKUP(L5,'Clb Q (2)'!I$3:O$7,4,0),\"\")","v":""},{"$f":"IF(INFO!B$8>7,VLOOKUP(L5,'Clb Q (2)'!I$3:O$7,5,0),\"\")","v":""},{"$f":"IF(INFO!B$8>7,LARGE('Clb Q (2)'!I$3:I$7,2),\"\")","v":""}]
[null,{"$f":"VLOOKUP(F6,'Clb Q (2)'!A$3:G$7,2,0)","v":"BAUDET Philippe"},{"$f":"VLOOKUP(F6,'Clb Q (2)'!A$3:G$7,3,0)","v":89},{"$f":"VLOOKUP(F6,'Clb Q (2)'!A$3:G$7,4,0)","v":90},{"$f":"VLOOKUP(F6,'Clb Q (2)'!A$3:G$7,5,0)","v":88},{"$f":"LARGE('Clb Q (2)'!A$3:A$7,3)","v":267.00000880900001},null,{"$f":"IF(INFO!B$8>7,VLOOKUP(L6,'Clb Q (2)'!I$3:O$7,2,0),\"\")","v":""},{"$f":"IF(INFO!B$8>7,VLOOKUP(L6,'Clb Q (2)'!I$3:O$7,3,0),\"\")","v":""},{"$f":"IF(INFO!B$8>7,VLOOKUP(L6,'Clb Q (2)'!I$3:O$7,4,0),\"\")","v":""},{"$f":"IF(INFO!B$8>7,VLOOKUP(L6,'Clb Q (2)'!I$3:O$7,5,0),\"\")","v":""},{"$f":"IF(INFO!B$8>7,LARGE('Clb Q (2)'!I$3:I$7,3),\"\")","v":""}]
[null,{"$f":"VLOOKUP(F7,'Clb Q (2)'!A$3:G$7,2,0)","v":"MERCIER Rémy"},{"$f":"VLOOKUP(F7,'Clb Q (2)'!A$3:G$7,3,0)","v":87},{"$f":"VLOOKUP(F7,'Clb Q (2)'!A$3:G$7,4,0)","v":88},{"$f":"VLOOKUP(F7,'Clb Q (2)'!A$3:G$7,5,0)","v":86},{"$f":"LARGE('Clb Q (2)'!A$3:A$7,4)","v":261.00000860879999},null,{"$f":"IF(INFO!B$8>7,VLOOKUP(L7,'Clb Q (2)'!I$3:O$7,2,0),\"\")","v":""},{"$f":"IF(INFO!B$8>7,VLOOKUP(L7,'Clb Q (2)'!I$3:O$7,3,0),\"\")","v":""},{"$f":"IF(INFO!B$8>7,VLOOKUP(L7,'Clb Q (2)'!I$3:O$7,4,0),\"\")","v":""},{"$f":"IF(INFO!B$8>7,VLOOKUP(L7,'Clb Q (2)'!I$3:O$7,5,0),\"\")","v":""},{"$f":"IF(INFO!B$8>7,LARGE('Clb Q (2)'!I$3:I$7,4),\"\")","v":""}]
[null,{"$f":"VLOOKUP(F8,'Clb Q (2)'!A$3:G$7,2,0)","v":"BRIAND Ptrick"},{"$f":"VLOOKUP(F8,'Clb Q (2)'!A$3:G$7,3,0)","v":83},{"$f":"VLOOKUP(F8,'Clb Q (2)'!A$3:G$7,4,0)","v":74},{"$f":"VLOOKUP(F8,'Clb Q (2)'!A$3:G$7,5,0)","v":77},{"$f":"LARGE('Clb Q (2)'!A$3:A$7,5)","v":234.00000770739999},null,{"$f":"IF(INFO!B$8>7,VLOOKUP(L8,'Clb Q (2)'!I$3:O$7,2,0),\"\")","v":""},{"$f":"IF(INFO!B$8>7,VLOOKUP(L8,'Clb Q (2)'!I$3:O$7,3,0),\"\")","v":""},{"$f":"IF(INFO!B$8>7,VLOOKUP(L8,'Clb Q (2)'!I$3:O$7,4,0),\"\")","v":""},{"$f":"IF(INFO!B$8>7,VLOOKUP(L8,'Clb Q (2)'!I$3:O$7,5,0),\"\")","v":""},{"$f":"IF(INFO!B$8>7,LARGE('Clb Q (2)'!I$3:I$7,5),\"\")","v":""}]
[]
[null,"CLUB N°2",{"$f":"'Clb Q (2)'!C9","v":"PONS   A.P.T.S"},null,null,{"$f":"'Clb Q (2)'!F9","v":1278},null,{"$f":"IF(INFO!B8>6,\"CLUB N°7\",\"\")","v":""},{"$f":"IF(INFO!B8>6,'Clb Q (2)'!K9,\"\")","v":""},null,null,{"$f":"IF(INFO!B8>6,'Clb Q (2)'!N9,\"\")","v":""}]
[null,"NOMS","série 1","série 2","série 3","POINTS",null,"NOMS","série 1","série 2","série 3","POINTS"]
[null,{"$f":"VLOOKUP(F12,'Clb Q (2)'!A$11:G$15,2,0)","v":"BERNARD Kevin"},{"$f":"VLOOKUP(F12,'Clb Q (2)'!A$11:G$15,3,0)","v":89},{"$f":"VLOOKUP(F12,'Clb Q (2)'!A$11:G$15,4,0)","v":90},{"$f":"VLOOKUP(F12,'Clb Q (2)'!A$11:G$15,5,0)","v":91},{"$f":"LARGE('Clb Q (2)'!A$11:A$15,1)","v":270.00000910900002},null,{"$f":"IF(INFO!B$8>6,VLOOKUP(L12,'Clb Q (2)'!I$11:O$15,2,0),\"\")","v":""},{"$f":"IF(INFO!B$8>6,VLOOKUP(L12,'Clb Q (2)'!I$11:O$15,3,0),\"\")","v":""},{"$f":"IF(INFO!B$8>6,VLOOKUP(L12,'Clb Q (2)'!I$11:O$15,4,0),\"\")","v":""},{"$f":"IF(INFO!B$8>6,VLOOKUP(L12,'Clb Q (2)'!I$11:O$15,5,0),\"\")","v":""},{"$f":"IF(INFO!B$8>6,LARGE('Clb Q (2)'!I$11:I$15,1),\"\")","v":""}]
[null,{"$f":"VLOOKUP(F13,'Clb Q (2)'!A$11:G$15,2,0)","v":"POULLY Pascal"},{"$f":"VLOOKUP(F13,'Clb Q (2)'!A$11:G$15,3,0)","v":84},{"$f":"VLOOKUP(F13,'Clb Q (2)'!A$11:G$15,4,0)","v":86},{"$f":"VLOOKUP(F13,'Clb Q (2)'!A$11:G$15,5,0)","v":89},{"$f":"LARGE('Clb Q (2)'!A$11:A$15,2)","v":259.00000890860002},null,{"$f":"IF(INFO!B$8>6,VLOOKUP(L13,'Clb Q (2)'!I$11:O$15,2,0),\"\")","v":""},{"$f":"IF(INFO!B$8>6,VLOOKUP(L13,'Clb Q (2)'!I$11:O$15,3,0),\"\")","v":""},{"$f":"IF(INFO!B$8>6,VLOOKUP(L13,'Clb Q (2)'!I$11:O$15,4,0),\"\")","v":""},{"$f":"IF(INFO!B$8>6,VLOOKUP(L13,'Clb Q (2)'!I$11:O$15,5,0),\"\")","v":""},{"$f":"IF(INFO!B$8>6,LARGE('Clb Q (2)'!I$11:I$15,2),\"\")","v":""}]
[null,{"$f":"VLOOKUP(F14,'Clb Q (2)'!A$11:G$15,2,0)","v":"ROUSSEAU Valérie"},{"$f":"VLOOKUP(F14,'Clb Q (2)'!A$11:G$15,3,0)","v":83},{"$f":"VLOOKUP(F14,'Clb Q (2)'!A$11:G$15,4,0)","v":82},{"$f":"VLOOKUP(F14,'Clb Q (2)'!A$11:G$15,5,0)","v":92},{"$f":"LARGE('Clb Q (2)'!A$11:A$15,3)","v":257.00000920820003},null,{"$f":"IF(INFO!B$8>6,VLOOKUP(L14,'Clb Q (2)'!I$11:O$15,2,0),\"\")","v":""},{"$f":"IF(INFO!B$8>6,VLOOKUP(L14,'Clb Q (2)'!I$11:O$15,3,0),\"\")","v":""},{"$f":"IF(INFO!B$8>6,VLOOKUP(L14,'Clb Q (2)'!I$11:O$15,4,0),\"\")","v":""},{"$f":"IF(INFO!B$8>6,VLOOKUP(L14,'Clb Q (2)'!I$11:O$15,5,0),\"\")","v":""},{"$f":"IF(INFO!B$8>6,LARGE('Clb Q (2)'!I$11:I$15,3),\"\")","v":""}]
[null,{"$f":"VLOOKUP(F15,'Clb Q (2)'!A$11:G$15,2,0)","v":"ROUSSEAU Thierry"},{"$f":"VLOOKUP(F15,'Clb Q (2)'!A$11:G$15,3,0)","v":87},{"$f":"VLOOKUP(F15,'Clb Q (2)'!A$11:G$15,4,0)","v":83},{"$f":"VLOOKUP(F15,'Clb Q (2)'!A$11:G$15,5,0)","v":85},{"$f":"LARGE('Clb Q (2)'!A$11:A$15,4)","v":255.0000085083},null,{"$f":"IF(INFO!B$8>6,VLOOKUP(L15,'Clb Q (2)'!I$11:O$15,2,0),\"\")","v":""},{"$f":"IF(INFO!B$8>6,VLOOKUP(L15,'Clb Q (2)'!I$11:O$15,3,0),\"\")","v":""},{"$f":"IF(INFO!B$8>6,VLOOKUP(L15,'Clb Q (2)'!I$11:O$15,4,0),\"\")","v":""},{"$f":"IF(INFO!B$8>6,VLOOKUP(L15,'Clb Q (2)'!I$11:O$15,5,0),\"\")","v":""},{"$f":"IF(INFO!B$8>6,LARGE('Clb Q (2)'!I$11:I$15,4),\"\")","v":""}]
[null,{"$f":"VLOOKUP(F16,'Clb Q (2)'!A$11:G$15,2,0)","v":"DEBAIN Nathalie"},{"$f":"VLOOKUP(F16,'Clb Q (2)'!A$11:G$15,3,0)","v":80},{"$f":"VLOOKUP(F16,'Clb Q (2)'!A$11:G$15,4,0)","v":82},{"$f":"VLOOKUP(F16,'Clb Q (2)'!A$11:G$15,5,0)","v":75},{"$f":"LARGE('Clb Q (2)'!A$11:A$15,5)","v":237.00000750820001},null,{"$f":"IF(INFO!B$8>6,VLOOKUP(L16,'Clb Q (2)'!I$11:O$15,2,0),\"\")","v":""},{"$f":"IF(INFO!B$8>6,VLOOKUP(L16,'Clb Q (2)'!I$11:O$15,3,0),\"\")","v":""},{"$f":"IF(INFO!B$8>6,VLOOKUP(L16,'Clb Q (2)'!I$11:O$15,4,0),\"\")","v":""},{"$f":"IF(INFO!B$8>6,VLOOKUP(L16,'Clb Q (2)'!I$11:O$15,5,0),\"\")","v":""},{"$f":"IF(INFO!B$8>6,LARGE('Clb Q (2)'!I$11:I$15,5),\"\")","v":""}]
[]
[null,{"$f":"IF(INFO!B8>2,\"CLUB N°3\",\"\")","v":"CLUB N°3"},{"$f":"IF(INFO!B8>2,'Clb Q (2)'!C17,\"\")","v":"JONZAC   S.J.T"},null,null,{"$f":"IF(INFO!B8>2,'Clb Q (2)'!F17,\"\")","v":1268},null,{"$f":"IF(INFO!B8>5,\"CLUB N°6\",\"\")","v":""},{"$f":"IF(INFO!B8>5,'Clb Q (2)'!K17,\"\")","v":""},null,null,{"$f":"IF(INFO!B8>5,'Clb Q (2)'!N17,\"\")","v":""}]
[null,"NOMS","série 1","série 2","série 3","POINTS",null,"NOMS","série 1","série 2","série 3","POINTS"]
[null,{"$f":"IF(INFO!B$8>2,VLOOKUP(F20,'Clb Q (2)'!A$19:G$23,2,0),\"\")","v":"ACHTOUK Kenza"},{"$f":"IF(INFO!B$8>2,VLOOKUP(F20,'Clb Q (2)'!A$19:G$23,3,0),\"\")","v":92},{"$f":"IF(INFO!B$8>2,VLOOKUP(F20,'Clb Q (2)'!A$19:G$23,4,0),\"\")","v":92},{"$f":"IF(INFO!B$8>2,VLOOKUP(F20,'Clb Q (2)'!A$19:G$23,5,0),\"\")","v":88},{"$f":"IF(INFO!B$8>2,LARGE('Clb Q (2)'!A$19:A$23,1),\"\")","v":272.00000880919998},null,{"$f":"IF(INFO!B$8>5,VLOOKUP(L20,'Clb Q (2)'!I$19:O$23,2,0),\"\")","v":""},{"$f":"IF(INFO!B$8>5,VLOOKUP(L20,'Clb Q (2)'!I$19:O$23,3,0),\"\")","v":""},{"$f":"IF(INFO!B$8>5,VLOOKUP(L20,'Clb Q (2)'!I$19:O$23,4,0),\"\")","v":""},{"$f":"IF(INFO!B$8>5,VLOOKUP(L20,'Clb Q (2)'!I$19:O$23,5,0),\"\")","v":""},{"$f":"IF(INFO!B$8>5,LARGE('Clb Q (2)'!I$19:I$23,1),\"\")","v":""}]
[null,{"$f":"IF(INFO!B$8>2,VLOOKUP(F21,'Clb Q (2)'!A$19:G$23,2,0),\"\")","v":"CORMELIER Hervé"},{"$f":"IF(INFO!B$8>2,VLOOKUP(F21,'Clb Q (2)'!A$19:G$23,3,0),\"\")","v":91},{"$f":"IF(INFO!B$8>2,VLOOKUP(F21,'Clb Q (2)'!A$19:G$23,4,0),\"\")","v":88},{"$f":"IF(INFO!B$8>2,VLOOKUP(F21,'Clb Q (2)'!A$19:G$23,5,0),\"\")","v":83},{"$f":"IF(INFO!B$8>2,LARGE('Clb Q (2)'!A$19:A$23,2),\"\")","v":262.00000830879998},null,{"$f":"IF(INFO!B$8>5,VLOOKUP(L21,'Clb Q (2)'!I$19:O$23,2,0),\"\")","v":""},{"$f":"IF(INFO!B$8>5,VLOOKUP(L21,'Clb Q (2)'!I$19:O$23,3,0),\"\")","v":""},{"$f":"IF(INFO!B$8>5,VLOOKUP(L21,'Clb Q (2)'!I$19:O$23,4,0),\"\")","v":""},{"$f":"IF(INFO!B$8>5,VLOOKUP(L21,'Clb Q (2)'!I$19:O$23,5,0),\"\")","v":""},{"$f":"IF(INFO!B$8>5,LARGE('Clb Q (2)'!I$19:I$23,2),\"\")","v":""}]
[null,{"$f":"IF(INFO!B$8>2,VLOOKUP(F22,'Clb Q (2)'!A$19:G$23,2,0),\"\")","v":"ARRIGONI Stéphane"},{"$f":"IF(INFO!B$8>2,VLOOKUP(F22,'Clb Q (2)'!A$19:G$23,3,0),\"\")","v":80},{"$f":"IF(INFO!B$8>2,VLOOKUP(F22,'Clb Q (2)'!A$19:G$23,4,0),\"\")","v":81},{"$f":"IF(INFO!B$8>2,VLOOKUP(F22,'Clb Q (2)'!A$19:G$23,5,0),\"\")","v":89},{"$f":"IF(INFO!B$8>2,LARGE('Clb Q (2)'!A$19:A$23,3),\"\")","v":250.0000089081},null,{"$f":"IF(INFO!B$8>5,VLOOKUP(L22,'Clb Q (2)'!I$19:O$23,2,0),\"\")","v":""},{"$f":"IF(INFO!B$8>5,VLOOKUP(L22,'Clb Q (2)'!I$19:O$23,3,0),\"\")","v":""},{"$f":"IF(INFO!B$8>5,VLOOKUP(L22,'Clb Q (2)'!I$19:O$23,4,0),\"\")","v":""},{"$f":"IF(INFO!B$8>5,VLOOKUP(L22,'Clb Q (2)'!I$19:O$23,5,0),\"\")","v":""},{"$f":"IF(INFO!B$8>5,LARGE('Clb Q (2)'!I$19:I$23,3),\"\")","v":""}]
[null,{"$f":"IF(INFO!B$8>2,VLOOKUP(F23,'Clb Q (2)'!A$19:G$23,2,0),\"\")","v":"GIOVANNONE Philippe"},{"$f":"IF(INFO!B$8>2,VLOOKUP(F23,'Clb Q (2)'!A$19:G$23,3,0),\"\")","v":84},{"$f":"IF(INFO!B$8>2,VLOOKUP(F23,'Clb Q (2)'!A$19:G$23,4,0),\"\")","v":80},{"$f":"IF(INFO!B$8>2,VLOOKUP(F23,'Clb Q (2)'!A$19:G$23,5,0),\"\")","v":83},{"$f":"IF(INFO!B$8>2,LARGE('Clb Q (2)'!A$19:A$23,4),\"\")","v":247.00000830799999},null,{"$f":"IF(INFO!B$8>5,VLOOKUP(L23,'Clb Q (2)'!I$19:O$23,2,0),\"\")","v":""},{"$f":"IF(INFO!B$8>5,VLOOKUP(L23,'Clb Q (2)'!I$19:O$23,3,0),\"\")","v":""},{"$f":"IF(INFO!B$8>5,VLOOKUP(L23,'Clb Q (2)'!I$19:O$23,4,0),\"\")","v":""},{"$f":"IF(INFO!B$8>5,VLOOKUP(L23,'Clb Q (2)'!I$19:O$23,5,0),\"\")","v":""},{"$f":"IF(INFO!B$8>5,LARGE('Clb Q (2)'!I$19:I$23,4),\"\")","v":""}]
[null,{"$f":"IF(INFO!B$8>2,VLOOKUP(F24,'Clb Q (2)'!A$19:G$23,2,0),\"\")","v":"SOURIS Christine"},{"$f":"IF(INFO!B$8>2,VLOOKUP(F24,'Clb Q (2)'!A$19:G$23,3,0),\"\")","v":81},{"$f":"IF(INFO!B$8>2,VLOOKUP(F24,'Clb Q (2)'!A$19:G$23,4,0),\"\")","v":75},{"$f":"IF(INFO!B$8>2,VLOOKUP(F24,'Clb Q (2)'!A$19:G$23,5,0),\"\")","v":81},{"$f":"IF(INFO!B$8>2,LARGE('Clb Q (2)'!A$19:A$23,5),\"\")","v":237.00000810750001},null,{"$f":"IF(INFO!B$8>5,VLOOKUP(L24,'Clb Q (2)'!I$19:O$23,2,0),\"\")","v":""},{"$f":"IF(INFO!B$8>5,VLOOKUP(L24,'Clb Q (2)'!I$19:O$23,3,0),\"\")","v":""},{"$f":"IF(INFO!B$8>5,VLOOKUP(L24,'Clb Q (2)'!I$19:O$23,4,0),\"\")","v":""},{"$f":"IF(INFO!B$8>5,VLOOKUP(L24,'Clb Q (2)'!I$19:O$23,5,0),\"\")","v":""},{"$f":"IF(INFO!B$8>5,LARGE('Clb Q (2)'!I$19:I$23,5),\"\")","v":""}]
[]
[null,{"$f":"IF(INFO!B8>3,\"CLUB N°4\",\"\")","v":"CLUB N°4"},{"$f":"IF(INFO!B8>3,'Clb Q (2)'!C25,\"\")","v":"SAINTES S.S.T"},null,null,{"$f":"IF(INFO!B8>3,'Clb Q (2)'!F25,\"\")","v":1142},null,{"$f":"IF(INFO!B8>4,\"CLUB N°5\",\"\")","v":""},{"$f":"IF(INFO!B8>4,'Clb Q (2)'!K25,\"\")","v":""},null,null,{"$f":"IF(INFO!B8>4,'Clb Q (2)'!N25,\"\")","v":""}]
[null,"NOMS","série 1","série 2","série 3","POINTS",null,"NOMS","série 1","série 2","série 3","POINTS"]
[null,{"$f":"IF(INFO!B$8>3,VLOOKUP(F28,'Clb Q (2)'!A$27:G$31,2,0),\"\")","v":"FLEURET Eric"},{"$f":"IF(INFO!B$8>3,VLOOKUP(F28,'Clb Q (2)'!A$27:G$31,3,0),\"\")","v":92},{"$f":"IF(INFO!B$8>3,VLOOKUP(F28,'Clb Q (2)'!A$27:G$31,4,0),\"\")","v":90},{"$f":"IF(INFO!B$8>3,VLOOKUP(F28,'Clb Q (2)'!A$27:G$31,5,0),\"\")","v":91},{"$f":"IF(INFO!B$8>3,LARGE('Clb Q (2)'!A$27:A$31,1),\"\")","v":273.00000910900002},null,{"$f":"IF(INFO!B$8>4,VLOOKUP(L28,'Clb Q (2)'!I$27:O$31,2,0),\"\")","v":""},{"$f":"IF(INFO!B$8>4,VLOOKUP(L28,'Clb Q (2)'!I$27:O$31,3,0),\"\")","v":""},{"$f":"IF(INFO!B$8>4,VLOOKUP(L28,'Clb Q (2)'!I$27:O$31,4,0),\"\")","v":""},{"$f":"IF(INFO!B$8>4,VLOOKUP(L28,'Clb Q (2)'!I$27:O$31,5,0),\"\")","v":""},{"$f":"IF(INFO!B$8>4,LARGE('Clb Q (2)'!I$27:I$31,1),\"\")","v":""}]
[null,{"$f":"IF(INFO!B$8>3,VLOOKUP(F29,'Clb Q (2)'!A$27:G$31,2,0),\"\")","v":"JACQUES Christophe"},{"$f":"IF(INFO!B$8>3,VLOOKUP(F29,'Clb Q (2)'!A$27:G$31,3,0),\"\")","v":89},{"$f":"IF(INFO!B$8>3,VLOOKUP(F29,'Clb Q (2)'!A$27:G$31,4,0),\"\")","v":88},{"$f":"IF(INFO!B$8>3,VLOOKUP(F29,'Clb Q (2)'!A$27:G$31,5,0),\"\")","v":88},{"$f":"IF(INFO!B$8>3,LARGE('Clb Q (2)'!A$27:A$31,2),\"\")","v":265.00000880879998},null,{"$f":"IF(INFO!B$8>4,VLOOKUP(L29,'Clb Q (2)'!I$27:O$31,2,0),\"\")","v":""},{"$f":"IF(INFO!B$8>4,VLOOKUP(L29,'Clb Q (2)'!I$27:O$31,3,0),\"\")","v":""},{"$f":"IF(INFO!B$8>4,VLOOKUP(L29,'Clb Q (2)'!I$27:O$31,4,0),\"\")","v":""},{"$f":"IF(INFO!B$8>4,VLOOKUP(L29,'Clb Q (2)'!I$27:O$31,5,0),\"\")","v":""},{"$f":"IF(INFO!B$8>4,LARGE('Clb Q (2)'!I$27:I$31,2),\"\")","v":""}]
[null,{"$f":"IF(INFO!B$8>3,VLOOKUP(F30,'Clb Q (2)'!A$27:G$31,2,0),\"\")","v":"SOULIER Jean"},{"$f":"IF(INFO!B$8>3,VLOOKUP(F30,'Clb Q (2)'!A$27:G$31,3,0),\"\")","v":81},{"$f":"IF(INFO!B$8>3,VLOOKUP(F30,'Clb Q (2)'!A$27:G$31,4,0),\"\")","v":84},{"$f":"IF(INFO!B$8>3,VLOOKUP(F30,'Clb Q (2)'!A$27:G$31,5,0),\"\")","v":83},{"$f":"IF(INFO!B$8>3,LARGE('Clb Q (2)'!A$27:A$31,3),\"\")","v":248.0000083084},null,{"$f":"IF(INFO!B$8>4,VLOOKUP(L30,'Clb Q (2)'!I$27:O$31,2,0),\"\")","v":""},{"$f":"IF(INFO!B$8>4,VLOOKUP(L30,'Clb Q (2)'!I$27:O$31,3,0),\"\")","v":""},{"$f":"IF(INFO!B$8>4,VLOOKUP(L30,'Clb Q (2)'!I$27:O$31,4,0),\"\")","v":""},{"$f":"IF(INFO!B$8>4,VLOOKUP(L30,'Clb Q (2)'!I$27:O$31,5,0),\"\")","v":""},{"$f":"IF(INFO!B$8>4,LARGE('Clb Q (2)'!I$27:I$31,3),\"\")","v":""}]
[null,{"$f":"IF(INFO!B$8>3,VLOOKUP(F31,'Clb Q (2)'!A$27:G$31,2,0),\"\")","v":"BOIN Bertrand"},{"$f":"IF(INFO!B$8>3,VLOOKUP(F31,'Clb Q (2)'!A$27:G$31,3,0),\"\")","v":71},{"$f":"IF(INFO!B$8>3,VLOOKUP(F31,'Clb Q (2)'!A$27:G$31,4,0),\"\")","v":75},{"$f":"IF(INFO!B$8>3,VLOOKUP(F31,'Clb Q (2)'!A$27:G$31,5,0),\"\")","v":79},{"$f":"IF(INFO!B$8>3,LARGE('Clb Q (2)'!A$27:A$31,4),\"\")","v":225.00000790750002},null,{"$f":"IF(INFO!B$8>4,VLOOKUP(L31,'Clb Q (2)'!I$27:O$31,2,0),\"\")","v":""},{"$f":"IF(INFO!B$8>4,VLOOKUP(L31,'Clb Q (2)'!I$27:O$31,3,0),\"\")","v":""},{"$f":"IF(INFO!B$8>4,VLOOKUP(L31,'Clb Q (2)'!I$27:O$31,4,0),\"\")","v":""},{"$f":"IF(INFO!B$8>4,VLOOKUP(L31,'Clb Q (2)'!I$27:O$31,5,0),\"\")","v":""},{"$f":"IF(INFO!B$8>4,LARGE('Clb Q (2)'!I$27:I$31,4),\"\")","v":""}]
[null,{"$f":"IF(INFO!B$8>3,VLOOKUP(F32,'Clb Q (2)'!A$27:G$31,2,0),\"\")","v":"RABAT Catherine"},{"$f":"IF(INFO!B$8>3,VLOOKUP(F32,'Clb Q (2)'!A$27:G$31,3,0),\"\")","v":52},{"$f":"IF(INFO!B$8>3,VLOOKUP(F32,'Clb Q (2)'!A$27:G$31,4,0),\"\")","v":46},{"$f":"IF(INFO!B$8>3,VLOOKUP(F32,'Clb Q (2)'!A$27:G$31,5,0),\"\")","v":33},{"$f":"IF(INFO!B$8>3,LARGE('Clb Q (2)'!A$27:A$31,5),\"\")","v":131.0000033046},null,{"$f":"IF(INFO!B$8>4,VLOOKUP(L32,'Clb Q (2)'!I$27:O$31,2,0),\"\")","v":""},{"$f":"IF(INFO!B$8>4,VLOOKUP(L32,'Clb Q (2)'!I$27:O$31,3,0),\"\")","v":""},{"$f":"IF(INFO!B$8>4,VLOOKUP(L32,'Clb Q (2)'!I$27:O$31,4,0),\"\")","v":""},{"$f":"IF(INFO!B$8>4,VLOOKUP(L32,'Clb Q (2)'!I$27:O$31,5,0),\"\")","v":""},{"$f":"IF(INFO!B$8>4,LARGE('Clb Q (2)'!I$27:I$31,5),\"\")","v":""}]

{"sheet":"P.F.","index":5,"n_rows":77,"n_cols":21,"rows_kept":77,"cut":false,"hidden":false,"merged":[[54,12,54,14],[70,7,76,8],[70,13,76,14],[56,10,56,11],[57,10,57,11],[58,10,58,11],[59,10,59,11],[60,10,60,11],[69,7,69,9],[69,12,69,14],[68,12,68,14],[64,12,64,14],[55,7,55,9],[55,12,55,14],[67,7,67,9],[67,12,67,14],[66,12,66,14],[56,7,62,8],[56,13,62,14],[65,12,65,14],[62,10,62,11],[72,10,72,11],[73,10,73,11],[1,1,1,20],[6,2,6,4],[7,2,7,4],[6,7,6,9],[7,7,7,9],[6,12,6,14],[6,17,6,19],[5,17,5,19],[4,7,4,9],[7,12,7,14],[5,2,5,4],[5,7,5,9],[5,12,5,14],[3,1,3,20],[4,15,4,16],[4,17,4,19],[4,2,4,4],[4,5,4,6],[4,12,4,14],[2,1,2,20],[7,17,7,19],[9,12,9,14],[10,2,16,3],[10,8,16,9],[9,2,9,4],[20,2,20,4],[24,2,30,3],[24,12,30,13],[22,12,22,14],[24,8,30,9],[19,7,19,9],[16,5,16,6],[18,5,18,6],[18,7,18,9],[21,2,21,4],[10,5,10,6],[11,5,11,6],[14,5,14,6],[12,5,12,6],[13,5,13,6],[19,2,19,4],[34,5,34,6],[34,7,34,9],[34,12,34,14],[24,5,24,6],[18,2,18,4],[37,12,37,14],[21,7,21,9],[20,12,20,14],[21,12,21,14],[23,2,23,4],[23,7,23,9],[20,7,20,9],[27,5,27,6],[26,5,26,6],[30,5,30,6],[22,2,22,4],[22,7,22,9],[35,2,35,4],[35,7,35,9],[35,12,35,14],[33,1,33,20],[34,2,34,4],[20,17,20,19],[21,17,21,19],[10,18,16,19],[18,17,18,19],[15,15,15,16],[50,12,50,14],[40,18,46,19],[23,12,23,14],[34,17,34,19],[16,15,16,16],[26,15,26,16],[27,15,27,16],[10,15,10,16],[13,15,13,16],[30,15,30,16],[43,15,43,16],[44,15,44,16],[45,15,45,16],[46,15,46,16],[39,17,39,19],[38,12,38,14],[38,17,38,19],[35,17,35,19],[24,18,30,19],[37,17,37,19],[36,17,36,19],[50,7,50,9],[50,10,50,11],[54,7,54,9],[43,5,43,6],[52,7,52,9],[53,7,53,9],[40,5,40,6],[41,5,41,6],[42,5,42,6],[44,5,44,6],[45,5,45,6],[46,5,46,6],[36,2,36,4],[37,2,37,4],[37,7,37,9],[36,7,36,9],[36,12,36,14],[40,2,46,3],[40,8,46,9],[40,15,40,16],[41,15,41,16],[42,15,42,16],[38,2,38,4],[38,7,38,9],[39,2,39,4],[39,7,39,9],[8,2,8,4],[8,12,8,14],[25,5,25,6],[28,5,28,6],[29,5,29,6],[19,17,19,19],[19,12,19,14],[24,15,24,16],[23,17,23,19],[8,17,8,19],[9,17,9,19],[22,17,22,19],[9,7,9,9],[8,7,8,9],[18,12,18,14],[18,15,18,16],[11,15,11,16],[14,15,14,16],[10,12,16,13],[12,15,12,16],[15,5,15,6],[25,15,25,16],[28,15,28,16],[29,15,29,16],[64,5,69,6],[74,10,74,11],[75,10,75,11],[76,10,76,11],[71,10,71,11],[34,15,34,16],[40,12,46,13],[50,15,55,16],[70,10,70,11],[49,7,49,14],[39,12,39,14],[64,15,69,16],[64,7,64,9],[64,10,64,11],[52,12,52,14],[51,7,51,9],[51,12,51,14],[65,7,65,9],[66,7,66,9],[63,7,63,14],[68,7,68,9],[53,12,53,14],[61,10,61,11],[50,5,55,6]]}
[]
[null,{"$f":"CONCATENATE(INFO!B7,\" - \",INFO!B9)","v":"PISTOLET - POITOU-CHARENTES"}]
[]
[null,"1er TOUR        1/4 FINALES         2e  TOUR"]
[null,null,{"$f":"'Clb Q'!C2","v":"ROCHEFORT   T.S.R"},null,null,"POSTE",null,{"$f":"'Clb Q'!I2","v":""},null,null,null,null,{"$f":"'Clb Q'!C18","v":"JONZAC   S.J.T"},null,null,"POSTE",null,{"$f":"'Clb Q'!I18","v":""}]
[null,null,{"$f":"'Clb Q'!B4","v":"BERGOGNE Cyril"},null,null,1,2,{"$f":"'Clb Q'!H4","v":""},null,null,null,null,{"$f":"'Clb Q'!B20","v":"ACHTOUK Kenza"},null,null,1,2,{"$f":"'Clb Q'!H20","v":""}]
[null,null,{"$f":"'Clb Q'!B5","v":"MERCIER Mickael"},null,null,3,4,{"$f":"'Clb Q'!H5","v":""},null,null,null,null,{"$f":"'Clb Q'!B21","v":"CORMELIER Hervé"},null,null,3,4,{"$f":"'Clb Q'!H21","v":""}]
[null,null,{"$f":"'Clb Q'!B6","v":"BAUDET Philippe"},null,null,5,6,{"$f":"'Clb Q'!H6","v":""},null,null,null,null,{"$f":"'Clb Q'!B22","v":"ARRIGONI Stéphane"},null,null,5,6,{"$f":"'Clb Q'!H22","v":""}]
[null,null,{"$f":"'Clb Q'!B7","v":"MERCIER Rémy"},null,null,7,8,{"$f":"'Clb Q'!H7","v":""},null,null,null,null,{"$f":"'Clb Q'!B23","v":"GIOVANNONE Philippe"},null,null,7,8,{"$f":"'Clb Q'!H23","v":""}]
[null,null,{"$f":"'Clb Q'!B8","v":"BRIAND Ptrick"},null,null,9,10,{"$f":"'Clb Q'!H8","v":""},null,null,null,null,{"$f":"'Clb Q'!B24","v":"SOURIS Christine"},null,null,9,10,{"$f":"'Clb Q'!H24","v":""}]
[null,{"$f":"IF(E11=\"\",\"\",IF(E11>2,1,0))","v":""},{"$f":"IF(E11=\"\",\"\",SUM(B11:B17))","v":""},null,null,null,null,null,{"$f":"IF(H11=\"\",\"\",SUM(K11:K17))","v":""},null,{"$f":"IF(H11=\"\",\"\",IF(H11>2,1,0))","v":""},{"$f":"IF(O11=\"\",\"\",IF(O11>2,1,0))","v":1},{"$f":"IF(O11=\"\",\"\",SUM(L11:L17))","v":4},null,5,null,null,null,{"$f":"IF(R11=\"\",\"\",SUM(U11:U17))","v":""},null,{"$f":"IF(R11=\"\",\"\",IF(R11>2,1,0))","v":""}]
[null,{"$f":"IF(E12=\"\",\"\",IF(E12>2,1,0))","v":""},null,null,null,null,null,null,null,null,{"$f":"IF(H12=\"\",\"\",IF(H12>2,1,0))","v":""},{"$f":"IF(O12=\"\",\"\",IF(O12>2,1,0))","v":1},null,null,5,null,null,null,null,null,""]
[null,"",null,null,null,null,null,null,null,null,"",1,null,null,5,null,null,null,null,null,""]
[null,"",null,null,null,null,null,null,null,null,"",1,null,null,5,null,null,null,null,null,""]
[null,"",null,null,null,null,null,null,null,null,"","",null,null,null,null,null,null,null,null,""]
[null,"",null,null,null,null,null,null,null,null,"","",null,null,null,null,null,null,null,null,""]
[null,"",null,null,null,null,null,null,null,null,"","",null,null,null,null,null,null,null,null,""]
[]
[null,null,{"$f":"'Clb Q'!I26","v":""},null,null,"POSTE",null,{"$f":"'Clb Q'!C26","v":"SAINTES S.S.T"},null,null,null,null,{"$f":"'Clb Q'!I10","v":""},null,null,"POSTE",null,{"$f":"'Clb Q'!C10","v":"PONS   A.P.T.S"}]
[null,null,{"$f":"'Clb Q'!H28","v":""},null,null,11,12,{"$f":"'Clb Q'!B28","v":"FLEURET Eric"},null,null,null,null,{"$f":"'Clb Q'!H12","v":""},null,null,11,12,{"$f":"'Clb Q'!B12","v":"BERNARD Kevin"}]
[null,null,{"$f":"'Clb Q'!H29","v":""},null,null,13,14,{"$f":"'Clb Q'!B29","v":"JACQUES Christophe"},null,null,null,null,{"$f":"'Clb Q'!H13","v":""},null,null,13,14,{"$f":"'Clb Q'!B13","v":"POULLY Pascal"}]
[null,null,{"$f":"'Clb Q'!H30","v":""},null,null,15,16,{"$f":"'Clb Q'!B30","v":"SOULIER Jean"},null,null,null,null,{"$f":"'Clb Q'!H14","v":""},null,null,15,16,{"$f":"'Clb Q'!B14","v":"ROUSSEAU Valérie"}]
[null,null,{"$f":"'Clb Q'!H31","v":""},null,null,17,18,{"$f":"'Clb Q'!B31","v":"BOIN Bertrand"},null,null,null,null,{"$f":"'Clb Q'!H15","v":""},null,null,17,18,{"$f":"'Clb Q'!B15","v":"ROUSSEAU Thierry"}]
[null,null,{"$f":"'Clb Q'!H32","v":""},null,null,19,20,{"$f":"'Clb Q'!B32","v":"RABAT Catherine"},null,null,null,null,{"$f":"'Clb Q'!H16","v":""},null,null,19,20,{"$f":"'Clb Q'!B16","v":"DEBAIN Nathalie"}]
[null,{"$f":"IF(E25=\"\",\"\",IF(E25>2,1,0))","v":""},{"$f":"IF(E25=\"\",\"\",SUM(B25:B31))","v":""},null,null,null,null,null,{"$f":"IF(H25=\"\",\"\",SUM(K25:K31))","v":""},null,{"$f":"IF(H25=\"\",\"\",IF(H25>2,1,0))","v":""},{"$f":"IF(O25=\"\",\"\",IF(O25>2,1,0))","v":0},{"$f":"IF(O25=\"\",\"\",SUM(L25:L31))","v":0},null,0,null,null,null,{"$f":"IF(R25=\"\",\"\",SUM(U25:U31))","v":""},null,{"$f":"IF(R25=\"\",\"\",IF(R25>2,1,0))","v":""}]
[null,{"$f":"IF(E26=\"\",\"\",IF(E26>2,1,0))","v":""},null,null,null,null,null,null,null,null,{"$f":"IF(H26=\"\",\"\",IF(H26>2,1,0))","v":""},{"$f":"IF(O26=\"\",\"\",IF(O26>2,1,0))","v":0},null,null,0,null,null,null,null,null,{"$f":"IF(R26=\"\",\"\",IF(R26>2,1,0))","v":""}]
[null,"",null,null,null,null,null,null,null,null,"",0,null,null,0,null,null,null,null,null,""]
[null,"",null,null,null,null,null,null,null,null,"",0,null,null,0,null,null,null,null,null,""]
[null,"",null,null,null,null,null,null,null,null,"","",null,null,null,null,null,null,null,null,""]
[null,"",null,null,null,null,null,null,null,null,"","",null,null,null,null,null,null,null,null,""]
[null,"",null,null,null,null,null,null,null,null,"","",null,null,null,null,null,null,null,null,""]
[]
[]
[null,"DEMI-FINALES"]
[null,null,{"$f":"IF(H5=\"\",C5,IF(C11=\"\",\"\",IF(I11=\"\",\"\",IF(C11>3,C5,IF(I11>3,H5,\"\")))))","v":"ROCHEFORT   T.S.R"},null,null,"POSTE",null,{"$f":"IF(C19=\"\",H19,IF(C25=\"\",\"\",IF(I25=\"\",\"\",IF(C25>3,C19,IF(I25>3,H19,\"\")))))","v":"SAINTES S.S.T"},null,null,null,null,{"$f":"IF(R5=\"\",M5,IF(M11=\"\",\"\",IF(S11=\"\",\"\",IF(M11>3,M5,IF(S11>3,R5,\"\")))))","v":"JONZAC   S.J.T"},null,null,"POSTE",null,{"$f":"IF(M19=\"\",R19,IF(M25=\"\",\"\",IF(S25=\"\",\"\",IF(M25>3,M19,IF(S25>3,R19,\"\")))))","v":"PONS   A.P.T.S"}]
[null,null,{"$f":"IF(H6=\"\",C6,IF(C11=\"\",\"\",IF(I11=\"\",\"\",IF(C11>3,C6,IF(I11>3,H6,\"\")))))","v":"BERGOGNE Cyril"},null,null,2,3,{"$f":"IF(C20=\"\",H20,IF(C25=\"\",\"\",IF(I25=\"\",\"\",IF(C25>3,C20,IF(I25>3,H20,\"\")))))","v":"FLEURET Eric"},null,null,null,null,{"$f":"IF(R6=\"\",M6,IF(M11=\"\",\"\",IF(S11=\"\",\"\",IF(M11>3,M6,IF(S11>3,R6,\"\")))))","v":"ACHTOUK Kenza"},null,null,12,13,{"$f":"IF(M20=\"\",R20,IF(M25=\"\",\"\",IF(S25=\"\",\"\",IF(M25>3,M20,IF(S25>3,R20,\"\")))))","v":"BERNARD Kevin"}]
[null,null,{"$f":"IF(H7=\"\",C7,IF(C11=\"\",\"\",IF(I11=\"\",\"\",IF(C11>3,C7,IF(I11>3,H7,\"\")))))","v":"MERCIER Mickael"},null,null,4,5,{"$f":"IF(C21=\"\",H21,IF(C25=\"\",\"\",IF(I25=\"\",\"\",IF(C25>3,C21,IF(I25>3,H21,\"\")))))","v":"JACQUES Christophe"},null,null,null,null,{"$f":"IF(R7=\"\",M7,IF(M11=\"\",\"\",IF(S11=\"\",\"\",IF(M11>3,M7,IF(S11>3,R7,\"\")))))","v":"CORMELIER Hervé"},null,null,14,15,{"$f":"IF(M21=\"\",R21,IF(M25=\"\",\"\",IF(S25=\"\",\"\",IF(M25>3,M21,IF(S25>3,R21,\"\")))))","v":"POULLY Pascal"}]
[null,null,{"$f":"IF(H8=\"\",C8,IF(C11=\"\",\"\",IF(I11=\"\",\"\",IF(C11>3,C8,IF(I11>3,H8,\"\")))))","v":"BAUDET Philippe"},null,null,6,7,{"$f":"IF(C22=\"\",H22,IF(C25=\"\",\"\",IF(I25=\"\",\"\",IF(C25>3,C22,IF(I25>3,H22,\"\")))))","v":"SOULIER Jean"},null,null,null,null,{"$f":"IF(R8=\"\",M8,IF(M11=\"\",\"\",IF(S11=\"\",\"\",IF(M11>3,M8,IF(S11>3,R8,\"\")))))","v":"ARRIGONI Stéphane"},null,null,16,17,{"$f":"IF(M22=\"\",R22,IF(M25=\"\",\"\",IF(S25=\"\",\"\",IF(M25>3,M22,IF(S25>3,R22,\"\")))))","v":"ROUSSEAU Valérie"}]
[null,null,{"$f":"IF(H9=\"\",C9,IF(C11=\"\",\"\",IF(I11=\"\",\"\",IF(C11>3,C9,IF(I11>3,H9,\"\")))))","v":"MERCIER Rémy"},null,null,8,9,{"$f":"IF(C23=\"\",H23,IF(C25=\"\",\"\",IF(I25=\"\",\"\",IF(C25>3,C23,IF(I25>3,H23,\"\")))))","v":"BOIN Bertrand"},null,null,null,null,{"$f":"IF(R9=\"\",M9,IF(M11=\"\",\"\",IF(S11=\"\",\"\",IF(M11>3,M9,IF(S11>3,R9,\"\")))))","v":"GIOVANNONE Philippe"},null,null,18,19,{"$f":"IF(M23=\"\",R23,IF(M25=\"\",\"\",IF(S25=\"\",\"\",IF(M25>3,M23,IF(S25>3,R23,\"\")))))","v":"ROUSSEAU Thierry"}]
[null,null,{"$f":"IF(H10=\"\",C10,IF(C11=\"\",\"\",IF(I11=\"\",\"\",IF(C11>3,C10,IF(I11>3,H10,\"\")))))","v":"BRIAND Ptrick"},null,null,10,11,{"$f":"IF(C24=\"\",H24,IF(C25=\"\",\"\",IF(I25=\"\",\"\",IF(C25>3,C24,IF(I25>3,H24,\"\")))))","v":"RABAT Catherine"},null,null,null,null,{"$f":"IF(R10=\"\",M10,IF(M11=\"\",\"\",IF(S11=\"\",\"\",IF(M11>3,M10,IF(S11>3,R10,\"\")))))","v":"SOURIS Christine"},null,null,20,21,{"$f":"IF(M24=\"\",R24,IF(M25=\"\",\"\",IF(S25=\"\",\"\",IF(M25>3,M24,IF(S25>3,R24,\"\")))))","v":"DEBAIN Nathalie"}]
[null,{"$f":"IF(E41=\"\",\"\",IF(E41>2,1,0))","v":1},{"$f":"IF(E41=\"\",\"\",SUM(B41:B47))","v":4},null,4,null,null,1,{"$f":"IF(H41=\"\",\"\",SUM(K41:K47))","v":1},null,{"$f":"IF(H41=\"\",\"\",IF(H41>2,1,0))","v":0},{"$f":"IF(O41=\"\",\"\",IF(O41>2,1,0))","v":1},{"$f":"IF(O41=\"\",\"\",SUM(L41:L47))","v":1},null,5,null,null,0,{"$f":"IF(R41=\"\",\"\",SUM(U41:U47))","v":4},null,{"$f":"IF(R41=\"\",\"\",IF(R41>2,1,0))","v":0}]
[null,{"$f":"IF(E42=\"\",\"\",IF(E42>2,1,0))","v":1},null,null,3,null,null,2,null,null,{"$f":"IF(H42=\"\",\"\",IF(H42>2,1,0))","v":0},{"$f":"IF(O42=\"\",\"\",IF(O42>2,1,0))","v":0},null,null,2,null,null,3,null,null,{"$f":"IF(R42=\"\",\"\",IF(R42>2,1,0))","v":1}]
[null,1,null,null,3,null,null,2,null,null,0,0,null,null,2,null,null,3,null,null,1]
[null,0,null,null,2,null,null,3,null,null,1,0,null,null,2,null,null,3,null,null,1]
[null,1,null,null,5,null,null,0,null,null,0,0,null,null,1,null,null,4,null,null,1]
[null,"",null,null,null,null,null,null,null,null,"","",null,null,null,null,null,null,null,null,""]
[null,"",null,null,null,null,null,null,null,null,"","",null,null,null,null,null,null,null,null,""]
[]
[]
[null,null,null,null,null,null,null,"PETITE FINALE"]
[null,null,null,null,null,null,null,{"$f":"IF(C41=\"\",\"\",IF(I41=\"\",\"\",IF(C41>3,H35,IF(I41>3,C35,\"\"))))","v":"SAINTES S.S.T"},null,null,"POSTE",null,{"$f":"IF(M41=\"\",\"\",IF(S41=\"\",\"\",IF(M41>3,R35,IF(S41>3,M35,\"\"))))","v":"JONZAC   S.J.T"}]
[null,null,null,null,null,null,null,{"$f":"IF(C41=\"\",\"\",IF(I41=\"\",\"\",IF(C41>3,H36,IF(I41>3,C36,\"\"))))","v":"FLEURET Eric"},null,null,2,3,{"$f":"IF(M41=\"\",\"\",IF(S41=\"\",\"\",IF(M41>3,R36,IF(S41>3,M36,\"\"))))","v":"ACHTOUK Kenza"}]
[null,null,null,null,null,null,null,{"$f":"IF(C41=\"\",\"\",IF(I41=\"\",\"\",IF(C41>3,H37,IF(I41>3,C37,\"\"))))","v":"JACQUES Christophe"},null,null,4,5,{"$f":"IF(M41=\"\",\"\",IF(S41=\"\",\"\",IF(M41>3,R37,IF(S41>3,M37,\"\"))))","v":"CORMELIER Hervé"}]
[null,null,null,null,null,null,null,{"$f":"IF(C41=\"\",\"\",IF(I41=\"\",\"\",IF(C41>3,H38,IF(I41>3,C38,\"\"))))","v":"SOULIER Jean"},null,null,6,7,{"$f":"IF(M41=\"\",\"\",IF(S41=\"\",\"\",IF(M41>3,R38,IF(S41>3,M38,\"\"))))","v":"ARRIGONI Stéphane"}]
[null,null,null,null,null,null,null,{"$f":"IF(C41=\"\",\"\",IF(I41=\"\",\"\",IF(C41>3,H39,IF(I41>3,C39,\"\"))))","v":"BOIN Bertrand"},null,null,8,9,{"$f":"IF(M41=\"\",\"\",IF(S41=\"\",\"\",IF(M41>3,R39,IF(S41>3,M39,\"\"))))","v":"GIOVANNONE Philippe"}]
[null,null,null,null,null,null,null,{"$f":"IF(C41=\"\",\"\",IF(I41=\"\",\"\",IF(C41>3,H40,IF(I41>3,C40,\"\"))))","v":"RABAT Catherine"},null,null,10,11,{"$f":"IF(M41=\"\",\"\",IF(S41=\"\",\"\",IF(M41>3,R40,IF(S41>3,M40,\"\"))))","v":"SOURIS Christine"}]
[null,null,null,null,null,null,{"$f":"IF(J57=\"\",\"\",IF(J57>2,1,0))","v":1},{"$f":"IF(J57=\"\",\"\",SUM(G57:G63))","v":4},null,4,null,null,1,{"$f":"IF(H35=\"\",IF(M51=\"\",\"\",4),IF(M57=\"\",\"\",SUM(P57:P63)))","v":3},null,{"$f":"IF(M57=\"\",\"\",IF(M57>2,1,0))","v":0}]
[null,null,null,null,null,null,{"$f":"IF(J58=\"\",\"\",IF(J58>2,1,0))","v":1},null,null,3,null,null,2,null,null,{"$f":"IF(M58=\"\",\"\",IF(M58>2,1,0))","v":0}]
[null,null,null,null,null,null,1,null,null,5,null,null,0,null,null,0]
[null,null,null,null,null,null,0,null,null,0,null,null,5,null,null,1]
[null,null,null,null,null,null,0,null,null,1,null,null,4,null,null,1]
[null,null,null,null,null,null,0,null,null,2,null,null,3,null,null,1]
[null,null,null,null,null,null,1,null,null,3,null,null,2,null,null,0]
[null,null,null,null,null,null,null,"FINALE"]
[null,null,null,null,null,null,null,{"$f":"IF(H35=\"\",C35,IF(C41=\"\",\"\",IF(I41=\"\",\"\",IF(C41>3,C35,IF(I41>3,H35,\"\")))))","v":"ROCHEFORT   T.S.R"},null,null,"POSTE",null,{"$f":"IF(M35=\"\",R35,IF(M41=\"\",\"\",IF(S41=\"\",\"\",IF(M41>3,M35,IF(S41>3,R35,\"\")))))","v":"PONS   A.P.T.S"}]
[null,null,null,null,null,null,null,{"$f":"IF(H36=\"\",C36,IF(C41=\"\",\"\",IF(I41=\"\",\"\",IF(C41>3,C36,IF(I41>3,H36,\"\")))))","v":"BERGOGNE Cyril"},null,null,2,3,{"$f":"IF(M36=\"\",R36,IF(M41=\"\",\"\",IF(S41=\"\",\"\",IF(M41>3,M36,IF(S41>3,R36,\"\")))))","v":"BERNARD Kevin"}]
[null,null,null,null,null,null,null,{"$f":"IF(H37=\"\",C37,IF(C41=\"\",\"\",IF(I41=\"\",\"\",IF(C41>3,C37,IF(I41>3,H37,\"\")))))","v":"MERCIER Mickael"},null,null,4,5,{"$f":"IF(M37=\"\",R37,IF(M41=\"\",\"\",IF(S41=\"\",\"\",IF(M41>3,M37,IF(S41>3,R37,\"\")))))","v":"POULLY Pascal"}]
[null,null,null,null,null,null,null,{"$f":"IF(H38=\"\",C38,IF(C41=\"\",\"\",IF(I41=\"\",\"\",IF(C41>3,C38,IF(I41>3,H38,\"\")))))","v":"BAUDET Philippe"},null,null,6,7,{"$f":"IF(M38=\"\",R38,IF(M41=\"\",\"\",IF(S41=\"\",\"\",IF(M41>3,M38,IF(S41>3,R38,\"\")))))","v":"ROUSSEAU Valérie"}]
[null,null,null,null,null,null,null,{"$f":"IF(H39=\"\",C39,IF(C41=\"\",\"\",IF(I41=\"\",\"\",IF(C41>3,C39,IF(I41>3,H39,\"\")))))","v":"MERCIER Rémy"},null,null,8,9,{"$f":"IF(M39=\"\",R39,IF(M41=\"\",\"\",IF(S41=\"\",\"\",IF(M41>3,M39,IF(S41>3,R39,\"\")))))","v":"ROUSSEAU Thierry"}]
[null,null,null,null,null,null,null,{"$f":"IF(H40=\"\",C40,IF(C41=\"\",\"\",IF(I41=\"\",\"\",IF(C41>3,C40,IF(I41>3,H40,\"\")))))","v":"BRIAND Ptrick"},null,null,10,11,{"$f":"IF(M40=\"\",R40,IF(M41=\"\",\"\",IF(S41=\"\",\"\",IF(M41>3,M40,IF(S41>3,R40,\"\")))))","v":"DEBAIN Nathalie"}]
[null,null,null,null,null,null,{"$f":"IF(J71=\"\",\"\",IF(J71>2,1,0))","v":1},{"$f":"IF(J71=\"\",\"\",SUM(G71:G77))","v":4},null,3,null,null,2,{"$f":"IF(M71=\"\",\"\",SUM(P71:P77))","v":0},null,{"$f":"IF(M71=\"\",\"\",IF(M71>2,1,0))","v":0}]
[null,null,null,null,null,null,{"$f":"IF(J72=\"\",\"\",IF(J72>2,1,0))","v":1},null,null,3,null,null,2,null,null,{"$f":"IF(M72=\"\",\"\",IF(M72>2,1,0))","v":0}]
[null,null,null,null,null,null,1,null,null,3,null,null,2,null,null,0]
[null,null,null,null,null,null,1,null,null,3,null,null,2,null,null,0]
[null,null,null,null,null,null,"",null,null,null,null,null,null,null,null,""]
[null,null,null,null,null,null,"",null,null,null,null,null,null,null,null,""]
[null,null,null,null,null,null,"",null,null,null,null,null,null,null,null,""]

{"sheet":"PALMARES","index":6,"n_rows":27,"n_cols":13,"rows_kept":27,"cut":false,"hidden":false,"merged":[[0,0,2,7],[3,0,3,7],[10,9,10,12],[11,6,14,6],[7,6,8,6],[9,6,10,6],[4,0,4,7]]}
[{"$f":"CONCATENATE(\"PALMARES\",\"  \",INFO!B6,\"\n\",\"CHAMPIONNAT DE FRANCE DES CLUBS\",\"\n\",\"10 METRES\")","v":"PALMARES  2021-2022\nCHAMPIONNAT DE FRANCE DES CLUBS\n10 METRES"}]
[]
[]
[{"$f":"CONCATENATE(INFO!B7,\"   \",INFO!B9)","v":"PISTOLET   POITOU-CHARENTES"}]
[]
[]
["PLACE","CLUBS","LIGUE","n° CLUB","M Q","Bar."]
[1,{"$f":"IF(A8=\"\",\"\",IF(P.F.!J71=\"\",\"\",IF(P.F.!H71>3,P.F.!H65,IF(P.F.!N71>3,P.F.!M65,\"\"))))","v":"ROCHEFORT   T.S.R"},null,{"$f":"IF(A8=\"\",\"\",IF(B8=\"\",\"\",VLOOKUP(B8,'M Q'!B$7:AI$14,2,0)))","v":1717160},{"$f":"IF(A8=\"\",\"\",IF(B8=\"\",\"\",VLOOKUP(B8,'M Q'!B$7:AI$14,33,0)))","v":1312},{"$f":"IF(A8=\"\",\"\",IF(B8=\"\",\"\",VLOOKUP(B8,'M Q'!B$7:AI$14,34,0)))","v":0},"FINALE"]
[{"$f":"IF(INFO!B8>1,2,\"\")","v":2},{"$f":"IF(A9=\"\",\"\",IF(P.F.!M71=\"\",\"\",IF(P.F.!H71>3,P.F.!M65,IF(P.F.!N71>3,P.F.!H65,\"\"))))","v":"PONS   A.P.T.S"},null,{"$f":"IF(A9=\"\",\"\",IF(B9=\"\",\"\",VLOOKUP(B9,'M Q'!B$7:AI$14,2,0)))","v":1717100},{"$f":"IF(A9=\"\",\"\",IF(B9=\"\",\"\",VLOOKUP(B9,'M Q'!B$7:AI$14,33,0)))","v":1278},{"$f":"IF(A9=\"\",\"\",IF(B9=\"\",\"\",VLOOKUP(B9,'M Q'!B$7:AI$14,34,0)))","v":0}]
[{"$f":"IF(INFO!B8>2,3,\"\")","v":3},{"$f":"IF(A10=\"\",\"\",IF(INFO!B8=3,P.F.!M51,IF(P.F.!J57=\"\",\"\",IF(P.F.!H57>3,P.F.!H51,IF(P.F.!N57>3,P.F.!M51,\"\")))))","v":"SAINTES S.S.T"},null,{"$f":"IF(A10=\"\",\"\",IF(B10=\"\",\"\",VLOOKUP(B10,'M Q'!B$7:AI$14,2,0)))","v":1717031},{"$f":"IF(A10=\"\",\"\",IF(B10=\"\",\"\",VLOOKUP(B10,'M Q'!B$7:AI$14,33,0)))","v":1142},{"$f":"IF(A10=\"\",\"\",IF(B10=\"\",\"\",VLOOKUP(B10,'M Q'!B$7:AI$14,34,0)))","v":0},"PETITE\nFINALE"]
[{"$f":"IF(INFO!B8>3,4,\"\")","v":4},{"$f":"IF(A11=\"\",\"\",IF(P.F.!M57=\"\",\"\",IF(P.F.!H57>3,P.F.!M51,IF(P.F.!N57>3,P.F.!H51,\"\"))))","v":"JONZAC   S.J.T"},null,{"$f":"IF(A11=\"\",\"\",IF(B11=\"\",\"\",VLOOKUP(B11,'M Q'!B$7:AI$14,2,0)))","v":1717165},{"$f":"IF(A11=\"\",\"\",IF(B11=\"\",\"\",VLOOKUP(B11,'M Q'!B$7:AI$14,33,0)))","v":1268},{"$f":"IF(A11=\"\",\"\",IF(B11=\"\",\"\",VLOOKUP(B11,'M Q'!B$7:AI$14,34,0)))","v":0},null,null,null,"1/4 finalistes sortants"]
[{"$f":"IF(INFO!B8>4,5,\"\")","v":""},{"$f":"IF(A12=\"\",\"\",VLOOKUP(E12,J$12:M$15,3,0))","v":""},null,{"$f":"IF(A12=\"\",\"\",VLOOKUP(E12,J$12:M$15,4,0))","v":""},{"$f":"IF(A12=\"\",\"\",LARGE(J12:J15,1))","v":""},{"$f":"IF(A12=\"\",\"\",IF(B12=\"\",\"\",VLOOKUP(B12,'M Q'!B$7:AI$14,34,0)))","v":""},"1 / 4   FINALES",null,null,{"$f":"IF(L12=\"\",0,VLOOKUP(L12,saisie!C$7:AL$26,36,0))","v":0},{"$f":"VLOOKUP(L12,saisie!C$7:AL$26,34,0)","v":{"$error":"#N/A"}},{"$f":"IF(P.F.!E11=\"\",\"\",IF(P.F.!C11>3,P.F.!H5,IF(P.F.!I11>3,P.F.!C5,\"\")))","v":""},{"$f":"VLOOKUP(L12,saisie!C$7:AL$26,2,0)","v":{"$error":"#N/A"}}]
[{"$f":"IF(INFO!B8>5,6,\"\")","v":""},{"$f":"IF(A13=\"\",\"\",VLOOKUP(E13,J$12:M$15,3,0))","v":""},null,{"$f":"IF(A13=\"\",\"\",VLOOKUP(E13,J$12:M$15,4,0))","v":""},{"$f":"IF(A13=\"\",\"\",LARGE(J12:J15,2))","v":""},{"$f":"IF(A13=\"\",\"\",IF(B13=\"\",\"\",VLOOKUP(B13,'M Q'!B$7:AI$14,34,0)))","v":""},null,null,null,{"$f":"IF(L13=\"\",0,VLOOKUP(L13,saisie!C$7:AL$26,36,0))","v":0},{"$f":"VLOOKUP(L13,saisie!C$7:AL$26,34,0)","v":{"$error":"#N/A"}},{"$f":"IF(P.F.!O11=\"\",\"\",IF(P.F.!M11>3,P.F.!R5,IF(P.F.!S11>3,P.F.!M5,\"\")))","v":""},{"$f":"VLOOKUP(L13,saisie!C$7:AL$26,2,0)","v":{"$error":"#N/A"}}]
[{"$f":"IF(INFO!B8>6,7,\"\")","v":""},{"$f":"IF(A14=\"\",\"\",VLOOKUP(E14,J$12:M$15,3,0))","v":""},null,{"$f":"IF(A14=\"\",\"\",VLOOKUP(E14,J$12:M$15,4,0))","v":""},{"$f":"IF(A14=\"\",\"\",LARGE(J12:J15,3))","v":""},{"$f":"IF(A14=\"\",\"\",IF(B14=\"\",\"\",VLOOKUP(B14,'M Q'!B$7:AI$14,34,0)))","v":""},null,null,null,{"$f":"IF(L14=\"\",0,VLOOKUP(L14,saisie!C$7:AL$26,36,0))","v":0},{"$f":"VLOOKUP(L14,saisie!C$7:AL$26,34,0)","v":{"$error":"#N/A"}},{"$f":"IF(P.F.!H25=\"\",\"\",IF(P.F.!C25>3,P.F.!H19,IF(P.F.!I25>3,P.F.!C19,\"\")))","v":""},{"$f":"VLOOKUP(L14,saisie!C$7:AL$26,2,0)","v":{"$error":"#N/A"}}]
[{"$f":"IF(INFO!B8>7,8,\"\")","v":""},{"$f":"IF(A15=\"\",\"\",VLOOKUP(E15,J$12:M$15,3,0))","v":""},null,{"$f":"IF(A15=\"\",\"\",VLOOKUP(E15,J$12:M$15,4,0))","v":""},{"$f":"IF(A15=\"\",\"\",LARGE(J12:J15,4))","v":""},{"$f":"IF(A15=\"\",\"\",IF(B15=\"\",\"\",VLOOKUP(B15,'M Q'!B$7:AI$14,34,0)))","v":""},null,null,null,{"$f":"IF(L15=\"\",0,VLOOKUP(L15,saisie!C$7:AL$26,36,0))","v":0},{"$f":"VLOOKUP(L15,saisie!C$7:AL$26,34,0)","v":{"$error":"#N/A"}},{"$f":"IF(P.F.!R25=\"\",\"\",IF(P.F.!M25>3,P.F.!R19,IF(P.F.!S25>3,P.F.!M19,\"\")))","v":""},{"$f":"VLOOKUP(L15,saisie!C$7:AL$26,2,0)","v":{"$error":"#N/A"}}]
[{"$f":"IF(INFO!B8>8,9,\"\")","v":""},{"$f":"IF(A16=\"\",\"\",IF('M Q'!AE15=\"\",\"\",'M Q'!B15))","v":""},null,{"$f":"IF(A16=\"\",\"\",IF('M Q'!AE15=\"\",\"\",'M Q'!C15))","v":""},{"$f":"IF(A16=\"\",\"\",IF('M Q'!AE15=\"\",\"\",'M Q'!AH15))","v":""},{"$f":"IF(A16=\"\",\"\",IF('M Q'!AE15=\"\",\"\",'M Q'!AI15))","v":""}]
[{"$f":"IF(INFO!B8>9,10,\"\")","v":""},{"$f":"IF(A17=\"\",\"\",IF('M Q'!AE16=\"\",\"\",'M Q'!B16))","v":""},null,{"$f":"IF(A17=\"\",\"\",IF('M Q'!AE16=\"\",\"\",'M Q'!C16))","v":""},{"$f":"IF(A17=\"\",\"\",IF('M Q'!AE16=\"\",\"\",'M Q'!AH16))","v":""},{"$f":"IF(A17=\"\",\"\",IF('M Q'!AE16=\"\",\"\",'M Q'!AI16))","v":""}]
[{"$f":"IF(INFO!B8>10,11,\"\")","v":""},{"$f":"IF(A18=\"\",\"\",IF('M Q'!AE17=\"\",\"\",'M Q'!B17))","v":""},null,{"$f":"IF(A18=\"\",\"\",IF('M Q'!AE17=\"\",\"\",'M Q'!C17))","v":""},{"$f":"IF(A18=\"\",\"\",IF('M Q'!AE17=\"\",\"\",'M Q'!AH17))","v":""},{"$f":"IF(A18=\"\",\"\",IF('M Q'!AE17=\"\",\"\",'M Q'!AI17))","v":""}]
[{"$f":"IF(INFO!B8>11,12,\"\")","v":""},{"$f":"IF(A19=\"\",\"\",IF('M Q'!AE18=\"\",\"\",'M Q'!B18))","v":""},null,{"$f":"IF(A19=\"\",\"\",IF('M Q'!AE18=\"\",\"\",'M Q'!C18))","v":""},{"$f":"IF(A19=\"\",\"\",IF('M Q'!AE18=\"\",\"\",'M Q'!AH18))","v":""},{"$f":"IF(A19=\"\",\"\",IF('M Q'!AE18=\"\",\"\",'M Q'!AI18))","v":""}]
[{"$f":"IF(INFO!B8>12,13,\"\")","v":""},{"$f":"IF(A20=\"\",\"\",IF('M Q'!AE19=\"\",\"\",'M Q'!B19))","v":""},null,{"$f":"IF(A20=\"\",\"\",IF('M Q'!AE19=\"\",\"\",'M Q'!C19))","v":""},{"$f":"IF(A20=\"\",\"\",IF('M Q'!AE19=\"\",\"\",'M Q'!AH19))","v":""},{"$f":"IF(A20=\"\",\"\",IF('M Q'!AE19=\"\",\"\",'M Q'!AI19))","v":""}]
[{"$f":"IF(INFO!B8>13,14,\"\")","v":""},{"$f":"IF(A21=\"\",\"\",IF('M Q'!AE20=\"\",\"\",'M Q'!B20))","v":""},null,{"$f":"IF(A21=\"\",\"\",IF('M Q'!AE20=\"\",\"\",'M Q'!C20))","v":""},{"$f":"IF(A21=\"\",\"\",IF('M Q'!AE20=\"\",\"\",'M Q'!AH20))","v":""},{"$f":"IF(A21=\"\",\"\",IF('M Q'!AE20=\"\",\"\",'M Q'!AI20))","v":""}]
[{"$f":"IF(INFO!B8>14,15,\"\")","v":""},{"$f":"IF(A22=\"\",\"\",IF('M Q'!AE21=\"\",\"\",'M Q'!B21))","v":""},null,{"$f":"IF(A22=\"\",\"\",IF('M Q'!AE21=\"\",\"\",'M Q'!C21))","v":""},{"$f":"IF(A22=\"\",\"\",IF('M Q'!AE21=\"\",\"\",'M Q'!AH21))","v":""},{"$f":"IF(A22=\"\",\"\",IF('M Q'!AE21=\"\",\"\",'M Q'!AI21))","v":""}]
[{"$f":"IF(INFO!B8>15,16,\"\")","v":""},{"$f":"IF(A23=\"\",\"\",IF('M Q'!AE22=\"\",\"\",'M Q'!B22))","v":""},null,{"$f":"IF(A23=\"\",\"\",IF('M Q'!AE22=\"\",\"\",'M Q'!C22))","v":""},{"$f":"IF(A23=\"\",\"\",IF('M Q'!AE22=\"\",\"\",'M Q'!AH22))","v":""},{"$f":"IF(A23=\"\",\"\",IF('M Q'!AE22=\"\",\"\",'M Q'!AI22))","v":""}]
[{"$f":"IF(INFO!B8>16,17,\"\")","v":""},{"$f":"IF(A24=\"\",\"\",IF('M Q'!AE23=\"\",\"\",'M Q'!B23))","v":""},null,{"$f":"IF(A24=\"\",\"\",IF('M Q'!AE23=\"\",\"\",'M Q'!C23))","v":""},{"$f":"IF(A24=\"\",\"\",IF('M Q'!AE23=\"\",\"\",'M Q'!AH23))","v":""},{"$f":"IF(A24=\"\",\"\",IF('M Q'!AE23=\"\",\"\",'M Q'!AI23))","v":""}]
[{"$f":"IF(INFO!B8>17,18,\"\")","v":""},{"$f":"IF(A25=\"\",\"\",IF('M Q'!AE24=\"\",\"\",'M Q'!B24))","v":""},null,{"$f":"IF(A25=\"\",\"\",IF('M Q'!AE24=\"\",\"\",'M Q'!C24))","v":""},{"$f":"IF(A25=\"\",\"\",IF('M Q'!AE24=\"\",\"\",'M Q'!AH24))","v":""},{"$f":"IF(A25=\"\",\"\",IF('M Q'!AE24=\"\",\"\",'M Q'!AI24))","v":""}]
[{"$f":"IF(INFO!B8>18,19,\"\")","v":""},{"$f":"IF(A26=\"\",\"\",IF('M Q'!AE25=\"\",\"\",'M Q'!B25))","v":""},null,{"$f":"IF(A26=\"\",\"\",IF('M Q'!AE25=\"\",\"\",'M Q'!C25))","v":""},{"$f":"IF(A26=\"\",\"\",IF('M Q'!AE25=\"\",\"\",'M Q'!AH25))","v":""},{"$f":"IF(A26=\"\",\"\",IF('M Q'!AE25=\"\",\"\",'M Q'!AI25))","v":""}]
[{"$f":"IF(INFO!B8>19,20,\"\")","v":""},{"$f":"IF(A27=\"\",\"\",IF('M Q'!AE26=\"\",\"\",'M Q'!B26))","v":""},null,{"$f":"IF(A27=\"\",\"\",IF('M Q'!AE26=\"\",\"\",'M Q'!C26))","v":""},{"$f":"IF(A27=\"\",\"\",IF('M Q'!AE26=\"\",\"\",'M Q'!AH26))","v":""},{"$f":"IF(A27=\"\",\"\",IF('M Q'!AE26=\"\",\"\",'M Q'!AI26))","v":""}]