{"text_format":"1","workbook":"xlsx","n_sheets":6,"sheets":["INFO","saisie","M Q","Clb Q","P.F.","PALMARES"],"not_rendered":{"charts":0,"images":4,"macros":0,"external_links":0,"defined_names":6,"comments":0,"pivot_tables":0},"unopened":[],"bounds":{"document_bytes":16777216,"sheet_cells":100000,"rows_first":2000,"rows_last":500,"rows_between":2000,"halvings":0,"cell_chars":16384,"cell_head_chars":4096},"cells_cut":0,"cells_raw":0,"read":"whole","date_system":"1904"}

{"sheet":"INFO","index":0,"n_rows":19,"n_cols":3,"rows_kept":19,"cut":false,"hidden":false,"merged":[[0,0,0,2],[1,0,1,2],[15,0,15,2],[18,0,18,1],[2,0,2,2],[10,0,10,2],[16,0,16,1],[17,0,17,1]]}
["PROGRAMME DE GESTION \nCHAMPIONNAT DE FRANCE DES CLUBS\nECOLE DE TIR"]
["remplir en lettres majuscules"]
["COMPETITION"]
["date :","15 ET 16 Janvier 2022"]
["lieu :","PONS"]
["saison :","2021-2022"]
["Discipline :","CARABINE","(CARABINE ou PISTOLET)"]
["Nombre d'équipe :",2]
["Ligue :","POITOU-CHARENTES","(EN MAJUSCULE)"]
[]
{"$rows_left_out":10}
{"sheet":"saisie","index":1,"n_rows":44,"n_cols":23,"rows_kept":44,"cut":false,"hidden":false,"merged":[[0,0,1,20],[2,10,2,11],[2,19,3,19],[2,20,3,20],[2,1,3,1],[2,8,3,8],[2,13,3,13],[2,18,3,18],[2,12,3,12],[2,15,2,16],[2,17,3,17],[2,0,3,0],[2,2,3,2],[2,3,3,3],[2,5,2,6],[2,7,3,7]]}
[{"$f":"CONCATENATE(INFO!B7,\" - \",INFO!B9)","v":"CARABINE - POITOU-CHARENTES"}]
[]
["POSTE","Classement\nprovisoire","CLUB","N° club","Nom","Séries",null,"Total","M*","Nom","Séries",null,"Total","M*","Nom","Séries",null,"Total","M*","TOTAL","Bar."]
[null,null,null,null,"BENJAMINS",1,2,null,null,"POUSSINS",1,2,null,null,"MINIMES",1,2]
[1,{"$f":"RANK(W5,W$5:W$44,0)","v":2},"JONZAC   S.J.T",1717165,"CRUCHET Luna",58.8,58.7,{"$f":"SUM(F5:G5)","v":117.5},null,"MIGNOT Axel",94.9,86.6,{"$f":"SUM(K5:L5)","v":181.5},null,"MILLEMONT Colline",57.4,67.3,{"$f":"SUM(P5:Q5)","v":124.69999999999999},null,{"$f":"SUM(H5+M5+R5)","v":423.7},{"$f":"I5+N5+S5","v":0},null,{"$f":"H5+M5+R5+(0.000001*(I5+N5+S5))+(0.000000001*(G5+L5+Q5))","v":423.7000002126}]
[2,{"$f":"RANK(W6,W$5:W$44,0)","v":1},"ROYAN   Les Mouettes",1717153,"CHAUVET Tiago",84.2,82,166.2,null,"CHOTARD Hugo",75.5,64.599999999999994,140.1,null,"LEYRAT Quentin",63.6,71.3,134.9,null,441.19999999999993,{"$f":"I6+N6+S6","v":0},null,{"$f":"H6+M6+R6+(0.000001*(I6+N6+S6))+(0.000000001*(G6+L6+Q6))","v":441.20000021789991}]
[3,3,null,null,null,null,null,0,null,null,null,null,0,null,null,null,null,0,null,0,0,null,0]
[4,3,null,null,null,null,null,0,null,null,null,null,0,null,null,null,null,0,null,0,0,null,0]
[5,3,null,null,null,null,null,0,null,null,null,null,0,null,null,null,null,0,null,0,0,null,0]
[6,3,null,null,null,null,null,0,null,null,null,null,0,null,null,null,null,0,null,0,0,null,0]
{"$rows_left_out":35}
{"sheet":"M Q","index":2,"n_rows":44,"n_cols":20,"rows_kept":44,"cut":false,"hidden":false,"merged":[[1,0,1,19],[2,4,2,5],[2,9,2,10],[2,14,2,15],[2,0,3,0],[2,6,3,6],[2,19,3,19],[2,1,3,1],[2,11,3,11],[2,16,3,16],[2,18,3,18],[2,2,3,2],[2,7,3,7],[2,12,3,12],[2,17,3,17]]}
[]
[{"$f":"CONCATENATE(\"MATCH DE QUALIFICATION\",\" - \",INFO!B7,\" - \",INFO!B9)","v":"MATCH DE QUALIFICATION - CARABINE - POITOU-CHARENTES"}]
["Cl.","CLUB","N° club","Nom","Séries",null,"Total","M*","Nom","Séries",null,"Total","M*","Nom","Séries",null,"Total","M*","TOTAL","Bar."]
[null,null,null,"BENJAMINS",1,2,null,null,"POUSSINS",1,2,null,null,"MINIMES",1,2]
[1,{"$f":"VLOOKUP(A5,saisie!B$5:W$44,2,0)","v":"ROYAN   Les Mouettes"},{"$f":"VLOOKUP(A5,saisie!B$5:W$44,3,0)","v":1717153},{"$f":"VLOOKUP(A5,saisie!B$5:W$44,4,0)","v":"CHAUVET Tiago"},{"$f":"VLOOKUP(A5,saisie!B$5:W$44,5,0)","v":84.2},{"$f":"VLOOKUP(A5,saisie!B$5:W$44,6,0)","v":82},{"$f":"SUM(E5:F5)","v":166.2},{"$f":"VLOOKUP(A5,saisie!B$5:W$44,8,0)","v":0},{"$f":"VLOOKUP(A5,saisie!B$5:W$44,9,0)","v":"CHOTARD Hugo"},{"$f":"VLOOKUP(A5,saisie!B$5:W$44,10,0)","v":75.5},{"$f":"VLOOKUP(A5,saisie!B$5:W$44,11,0)","v":64.599999999999994},{"$f":"SUM(J5:K5)","v":140.1},{"$f":"VLOOKUP(A5,saisie!B$5:W$44,13,0)","v":0},{"$f":"VLOOKUP(A5,saisie!B$5:W$44,14,0)","v":"LEYRAT Quentin"},{"$f":"VLOOKUP(A5,saisie!B$5:W$44,15,0)","v":63.6},{"$f":"VLOOKUP(A5,saisie!B$5:W$44,16,0)","v":71.3},{"$f":"SUM(O5:P5)","v":134.9},{"$f":"VLOOKUP(A5,saisie!B$5:W$44,18,0)","v":0},{"$f":"SUM(G5+L5+Q5)","v":441.19999999999993},{"$f":"VLOOKUP(A5,saisie!B$5:W$44,20,0)","v":0}]
[{"$f":"IF(INFO!B8>1,2,\"\")","v":2},{"$f":"VLOOKUP(A6,saisie!B$5:W$44,2,0)","v":"JONZAC   S.J.T"},{"$f":"VLOOKUP(A6,saisie!B$5:W$44,3,0)","v":1717165},{"$f":"VLOOKUP(A6,saisie!B$5:W$44,4,0)","v":"CRUCHET Luna"},{"$f":"VLOOKUP(A6,saisie!B$5:W$44,5,0)","v":58.8},{"$f":"VLOOKUP(A6,saisie!B$5:W$44,6,0)","v":58.7},117.5,{"$f":"VLOOKUP(A6,saisie!B$5:W$44,8,0)","v":0},{"$f":"VLOOKUP(A6,saisie!B$5:W$44,9,0)","v":"MIGNOT Axel"},{"$f":"VLOOKUP(A6,saisie!B$5:W$44,10,0)","v":94.9},{"$f":"VLOOKUP(A6,saisie!B$5:W$44,11,0)","v":86.6},181.5,{"$f":"VLOOKUP(A6,saisie!B$5:W$44,13,0)","v":0},{"$f":"VLOOKUP(A6,saisie!B$5:W$44,14,0)","v":"MILLEMONT Colline"},{"$f":"VLOOKUP(A6,saisie!B$5:W$44,15,0)","v":57.4},{"$f":"VLOOKUP(A6,saisie!B$5:W$44,16,0)","v":67.3},124.69999999999999,{"$f":"VLOOKUP(A6,saisie!B$5:W$44,18,0)","v":0},423.7,{"$f":"VLOOKUP(A6,saisie!B$5:W$44,20,0)","v":0}]
[{"$f":"IF(INFO!B8>2,3,\"\")","v":""},{"$f":"VLOOKUP(A7,saisie!B$5:W$44,2,0)","v":{"$error":"#N/A"}},{"$f":"VLOOKUP(A7,saisie!B$5:W$44,3,0)","v":{"$error":"#N/A"}},{"$f":"VLOOKUP(A7,saisie!B$5:W$44,4,0)","v":{"$error":"#N/A"}},{"$f":"VLOOKUP(A7,saisie!B$5:W$44,5,0)","v":{"$error":"#N/A"}},{"$f":"VLOOKUP(A7,saisie!B$5:W$44,6,0)","v":{"$error":"#N/A"}},{"$error":"#N/A"},{"$f":"VLOOKUP(A7,saisie!B$5:W$44,8,0)","v":{"$error":"#N/A"}},{"$f":"VLOOKUP(A7,saisie!B$5:W$44,9,0)","v":{"$error":"#N/A"}},{"$f":"VLOOKUP(A7,saisie!B$5:W$44,10,0)","v":{"$error":"#N/A"}},{"$f":"VLOOKUP(A7,saisie!B$5:W$44,11,0)","v":{"$error":"#N/A"}},{"$error":"#N/A"},{"$f":"VLOOKUP(A7,saisie!B$5:W$44,13,0)","v":{"$error":"#N/A"}},{"$f":"VLOOKUP(A7,saisie!B$5:W$44,14,0)","v":{"$error":"#N/A"}},{"$f":"VLOOKUP(A7,saisie!B$5:W$44,15,0)","v":{"$error":"#N/A"}},{"$f":"VLOOKUP(A7,saisie!B$5:W$44,16,0)","v":{"$error":"#N/A"}},{"$error":"#N/A"},{"$f":"VLOOKUP(A7,saisie!B$5:W$44,18,0)","v":{"$error":"#N/A"}},{"$error":"#N/A"},{"$f":"VLOOKUP(A7,saisie!B$5:W$44,20,0)","v":{"$error":"#N/A"}}]
[{"$f":"IF(INFO!B8>3,4,\"\")","v":""},{"$f":"VLOOKUP(A8,saisie!B$5:W$44,2,0)","v":{"$error":"#N/A"}},{"$f":"VLOOKUP(A8,saisie!B$5:W$44,3,0)","v":{"$error":"#N/A"}},{"$f":"VLOOKUP(A8,saisie!B$5:W$44,4,0)","v":{"$error":"#N/A"}},{"$f":"VLOOKUP(A8,saisie!B$5:W$44,5,0)","v":{"$error":"#N/A"}},{"$f":"VLOOKUP(A8,saisie!B$5:W$44,6,0)","v":{"$error":"#N/A"}},{"$error":"#N/A"},{"$f":"VLOOKUP(A8,saisie!B$5:W$44,8,0)","v":{"$error":"#N/A"}},{"$f":"VLOOKUP(A8,saisie!B$5:W$44,9,0)","v":{"$error":"#N/A"}},{"$f":"VLOOKUP(A8,saisie!B$5:W$44,10,0)","v":{"$error":"#N/A"}},{"$f":"VLOOKUP(A8,saisie!B$5:W$44,11,0)","v":{"$error":"#N/A"}},{"$error":"#N/A"},{"$f":"VLOOKUP(A8,saisie!B$5:W$44,13,0)","v":{"$error":"#N/A"}},{"$f":"VLOOKUP(A8,saisie!B$5:W$44,14,0)","v":{"$error":"#N/A"}},{"$f":"VLOOKUP(A8,saisie!B$5:W$44,15,0)","v":{"$error":"#N/A"}},{"$f":"VLOOKUP(A8,saisie!B$5:W$44,16,0)","v":{"$error":"#N/A"}},{"$error":"#N/A"},{"$f":"VLOOKUP(A8,saisie!B$5:W$44,18,0)","v":{"$error":"#N/A"}},{"$error":"#N/A"},{"$f":"VLOOKUP(A8,saisie!B$5:W$44,20,0)","v":{"$error":"#N/A"}}]
[{"$f":"IF(INFO!B8>4,5,\"\")","v":""},{"$f":"VLOOKUP(A9,saisie!B$5:W$44,2,0)","v":{"$error":"#N/A"}},{"$f":"VLOOKUP(A9,saisie!B$5:W$44,3,0)","v":{"$error":"#N/A"}},{"$f":"VLOOKUP(A9,saisie!B$5:W$44,4,0)","v":{"$error":"#N/A"}},{"$f":"VLOOKUP(A9,saisie!B$5:W$44,5,0)","v":{"$error":"#N/A"}},{"$f":"VLOOKUP(A9,saisie!B$5:W$44,6,0)","v":{"$error":"#N/A"}},{"$error":"#N/A"},{"$f":"VLOOKUP(A9,saisie!B$5:W$44,8,0)","v":{"$error":"#N/A"}},{"$f":"VLOOKUP(A9,saisie!B$5:W$44,9,0)","v":{"$error":"#N/A"}},{"$f":"VLOOKUP(A9,saisie!B$5:W$44,10,0)","v":{"$error":"#N/A"}},{"$f":"VLOOKUP(A9,saisie!B$5:W$44,11,0)","v":{"$error":"#N/A"}},{"$error":"#N/A"},{"$f":"VLOOKUP(A9,saisie!B$5:W$44,13,0)","v":{"$error":"#N/A"}},{"$f":"VLOOKUP(A9,saisie!B$5:W$44,14,0)","v":{"$error":"#N/A"}},{"$f":"VLOOKUP(A9,saisie!B$5:W$44,15,0)","v":{"$error":"#N/A"}},{"$f":"VLOOKUP(A9,saisie!B$5:W$44,16,0)","v":{"$error":"#N/A"}},{"$error":"#N/A"},{"$f":"VLOOKUP(A9,saisie!B$5:W$44,18,0)","v":{"$error":"#N/A"}},{"$error":"#N/A"},{"$f":"VLOOKUP(A9,saisie!B$5:W$44,20,0)","v":{"$error":"#N/A"}}]
[{"$f":"IF(INFO!B8>5,6,\"\")","v":""},{"$f":"VLOOKUP(A10,saisie!B$5:W$44,2,0)","v":{"$error":"#N/A"}},{"$f":"VLOOKUP(A10,saisie!B$5:W$44,3,0)","v":{"$error":"#N/A"}},{"$f":"VLOOKUP(A10,saisie!B$5:W$44,4,0)","v":{"$error":"#N/A"}},{"$f":"VLOOKUP(A10,saisie!B$5:W$44,5,0)","v":{"$error":"#N/A"}},{"$f":"VLOOKUP(A10,saisie!B$5:W$44,6,0)","v":{"$error":"#N/A"}},{"$error":"#N/A"},{"$f":"VLOOKUP(A10,saisie!B$5:W$44,8,0)","v":{"$error":"#N/A"}},{"$f":"VLOOKUP(A10,saisie!B$5:W$44,9,0)","v":{"$error":"#N/A"}},{"$f":"VLOOKUP(A10,saisie!B$5:W$44,10,0)","v":{"$error":"#N/A"}},{"$f":"VLOOKUP(A10,saisie!B$5:W$44,11,0)","v":{"$error":"#N/A"}},{"$error":"#N/A"},{"$f":"VLOOKUP(A10,saisie!B$5:W$44,13,0)","v":{"$error":"#N/A"}},{"$f":"VLOOKUP(A10,saisie!B$5:W$44,14,0)","v":{"$error":"#N/A"}},{"$f":"VLOOKUP(A10,saisie!B$5:W$44,15,0)","v":{"$error":"#N/A"}},{"$f":"VLOOKUP(A10,saisie!B$5:W$44,16,0)","v":{"$error":"#N/A"}},{"$error":"#N/A"},{"$f":"VLOOKUP(A10,saisie!B$5:W$44,18,0)","v":{"$error":"#N/A"}},{"$error":"#N/A"},{"$f":"VLOOKUP(A10,saisie!B$5:W$44,20,0)","v":{"$error":"#N/A"}}]
{"$rows_left_out":35}
{"sheet":"Clb Q","index":3,"n_rows":26,"n_cols":20,"rows_kept":26,"cut":false,"hidden":false,"merged":[[3,7,3,8],[3,17,3,18],[21,7,21,8],[21,17,21,18],[15,7,15,8],[15,17,15,18],[0,1,0,19],[1,1,1,19],[21,2,21,3],[15,2,15,3],[9,2,9,3],[3,2,3,3],[3,12,3,13],[9,12,9,13],[15,12,15,13],[21,12,21,13],[9,7,9,8],[9,17,9,18]]}
[null,{"$f":"CONCATENATE(INFO!B7,\"    \",INFO!B9)","v":"CARABINE    POITOU-CHARENTES"}]
[null,"CLUBS QUALIFIES EN PHASE FINALE"]
[]
[null,"1er Match Qualif.",{"$f":"'M Q'!B5","v":"ROYAN   Les Mouettes"},null,{"$f":"'M Q'!S5","v":441.19999999999993},null,{"$f":"IF(INFO!B8>7,\"8e MQ\",\"\")","v":""},{"$f":"IF(INFO!B8>7,'M Q'!B12,\"\")","v":""},null,{"$f":"IF(INFO!B8>7,'M Q'!S12,\"\")","v":""},null,"9e MQ",{"$f":"IF(INFO!B8>8,'M Q'!B13,\"\")","v":""},null,{"$f":"IF(INFO!B8>8,'M Q'!S13,\"\")","v":""},null,"16e MQ",{"$f":"IF(INFO!B8>15,'M Q'!B20,\"\")","v":""},null,{"$f":"IF(INFO!B8>15,'M Q'!S20,\"\")","v":""}]
[null,"NOMS","série 1","série 2","POINTS",null,"NOMS","série 1","série 2","POINTS",null,"NOMS","série 1","série 2","POINTS",null,"NOMS","série 1","série 2","POINTS"]
[null,{"$f":"'M Q'!D5","v":"CHAUVET Tiago"},{"$f":"'M Q'!E5","v":84.2},{"$f":"'M Q'!F5","v":82},{"$f":"SUM(C6:D6)","v":166.2},null,{"$f":"IF(INFO!B8>7,'M Q'!D12,\"\")","v":""},{"$f":"IF(INFO!B8>7,'M Q'!E12,\"\")","v":""},{"$f":"IF(INFO!B8>7,'M Q'!F12,\"\")","v":""},{"$f":"IF(INFO!B8>7,SUM(H6:I6),\"\")","v":""},null,{"$f":"IF(INFO!B8>8,'M Q'!D13,\"\")","v":""},{"$f":"IF(INFO!B8>8,'M Q'!E13,\"\")","v":""},{"$f":"IF(INFO!B8>8,'M Q'!F13,\"\")","v":""},{"$f":"IF(INFO!B8>8,SUM(M6:N6),\"\")","v":""},null,{"$f":"IF(INFO!B8>15,'M Q'!D20,\"\")","v":""},{"$f":"IF(INFO!B8>15,'M Q'!E20,\"\")","v":""},{"$f":"IF(INFO!B8>15,'M Q'!F20,\"\")","v":""},{"$f":"IF(INFO!B8>15,SUM(R6:S6),\"\")","v":""}]
[null,{"$f":"'M Q'!I5","v":"CHOTARD Hugo"},{"$f":"'M Q'!J5","v":75.5},{"$f":"'M Q'!K5","v":64.599999999999994},{"$f":"SUM(C7:D7)","v":140.1},null,{"$f":"IF(INFO!B8>7,'M Q'!I12,\"\")","v":""},{"$f":"IF(INFO!B8>7,'M Q'!J12,\"\")","v":""},{"$f":"IF(INFO!B8>7,'M Q'!K12,\"\")","v":""},{"$f":"IF(INFO!B8>7,SUM(H7:I7),\"\")","v":""},null,{"$f":"IF(INFO!B8>8,'M Q'!I13,\"\")","v":""},{"$f":"IF(INFO!B8>8,'M Q'!J13,\"\")","v":""},{"$f":"IF(INFO!B8>8,'M Q'!K13,\"\")","v":""},{"$f":"IF(INFO!B8>8,SUM(M7:N7),\"\")","v":""},null,{"$f":"IF(INFO!B8>15,'M Q'!I20,\"\")","v":""},{"$f":"IF(INFO!B8>15,'M Q'!J20,\"\")","v":""},{"$f":"IF(INFO!B8>15,'M Q'!K20,\"\")","v":""},{"$f":"IF(INFO!B8>15,SUM(R7:S7),\"\")","v":""}]
[null,{"$f":"'M Q'!N5","v":"LEYRAT Quentin"},{"$f":"'M Q'!O5","v":63.6},{"$f":"'M Q'!P5","v":71.3},{"$f":"SUM(C8:D8)","v":134.9},null,{"$f":"IF(INFO!B8>7,'M Q'!N12,\"\")","v":""},{"$f":"IF(INFO!B8>7,'M Q'!O12,\"\")","v":""},{"$f":"IF(INFO!B8>7,'M Q'!P12,\"\")","v":""},{"$f":"IF(INFO!B8>7,SUM(H8:I8),\"\")","v":""},null,{"$f":"IF(INFO!B8>8,'M Q'!N13,\"\")","v":""},{"$f":"IF(INFO!B8>8,'M Q'!O13,\"\")","v":""},{"$f":"IF(INFO!B8>8,'M Q'!P13,\"\")","v":""},{"$f":"IF(INFO!B8>8,SUM(M8:N8),\"\")","v":""},null,{"$f":"IF(INFO!B8>15,'M Q'!N20,\"\")","v":""},{"$f":"IF(INFO!B8>15,'M Q'!O20,\"\")","v":""},{"$f":"IF(INFO!B8>15,'M Q'!P20,\"\")","v":""},{"$f":"IF(INFO!B8>15,SUM(R8:S8),\"\")","v":""}]
[]
[null,"2e MQ",{"$f":"'M Q'!B6","v":"JONZAC   S.J.T"},null,{"$f":"'M Q'!S6","v":423.7},null,{"$f":"IF(INFO!B8>6,\"7e MQ\",\"\")","v":""},{"$f":"IF(INFO!B8>6,'M Q'!B11,\"\")","v":""},null,{"$f":"IF(INFO!B8>6,'M Q'!S11,\"\")","v":""},null,"10e MQ",{"$f":"IF(INFO!B8>9,'M Q'!B14,\"\")","v":""},null,{"$f":"IF(INFO!B8>9,'M Q'!S14,\"\")","v":""},null,"15e MQ",{"$f":"IF(INFO!B8>14,'M Q'!B19,\"\")","v":""},null,{"$f":"IF(INFO!B8>14,'M Q'!S19,\"\")","v":""}]
{"$rows_left_out":17}
{"sheet":"P.F.","index":4,"n_rows":104,"n_cols":20,"rows_kept":104,"cut":false,"hidden":false,"merged":[[74,14,74,15],[75,14,75,15],[76,14,76,15],[93,9,93,10],[97,9,97,10],[98,9,98,10],[99,9,99,10],[100,9,100,10],[79,9,79,10],[78,6,78,13],[87,9,87,10],[88,9,88,10],[80,6,80,8],[80,11,80,13],[79,6,79,8],[95,11,95,13],[93,11,93,13],[81,6,81,8],[81,11,81,13],[82,6,82,8],[94,6,94,8],[63,14,63,15],[70,4,70,5],[71,4,71,5],[72,4,72,5],[70,14,70,15],[71,14,71,15],[72,14,72,15],[63,4,63,5],[66,14,66,15],[66,6,66,8],[66,11,66,13],[60,14,60,15],[61,14,61,15],[62,14,62,15],[43,14,43,15],[55,11,55,13],[55,14,55,15],[53,14,53,15],[58,11,58,13],[45,14,45,15],[46,11,46,13],[59,14,59,15],[58,16,58,18],[47,16,47,18],[48,16,48,18],[47,6,47,8],[38,16,38,18],[46,16,46,18],[45,16,45,18],[45,6,45,8],[45,11,45,13],[56,16,56,18],[56,11,56,13],[50,14,50,15],[51,14,51,15],[52,14,52,15],[49,17,53,18],[44,0,44,19],[38,1,38,3],[40,14,40,15],[38,11,38,13],[55,16,55,18],[49,14,49,15],[47,11,47,13],[39,17,43,18],[46,6,46,8],[3,4,3,5],[31,4,31,5],[32,4,32,5],[35,1,35,3],[35,6,35,8],[29,4,29,5],[30,4,30,5],[47,1,47,3],[39,4,39,5],[46,1,46,3],[28,4,28,5],[45,1,45,3],[45,4,45,5],[23,0,23,19],[25,16,25,18],[24,16,24,18],[39,7,43,8],[41,4,41,5],[42,4,42,5],[37,6,37,8],[28,11,32,12],[37,11,37,13],[11,14,11,15],[17,14,17,15],[36,16,36,18],[31,14,31,15],[32,14,32,15],[26,6,26,8],[26,11,26,13],[26,16,26,18],[24,14,24,15],[21,14,21,15],[19,14,19,15],[20,14,20,15],[17,7,21,8],[17,11,21,12],[17,17,21,18],[37,16,37,18],[27,16,27,18],[28,1,32,2],[39,1,43,2],[28,7,32,8],[27,1,27,3],[27,6,27,8],[27,11,27,13],[26,1,26,3],[41,14,41,15],[38,6,38,8],[42,14,42,15],[43,4,43,5],[40,4,40,5],[39,14,39,15],[39,11,43,12],[36,6,36,8],[36,11,36,13],[28,17,32,18],[35,16,35,18],[35,14,35,15],[28,14,28,15],[29,14,29,15],[30,14,30,15],[17,4,17,5],[24,6,24,8],[13,14,13,15],[13,4,13,5],[20,4,20,5],[21,4,21,5],[14,16,14,18],[15,6,15,8],[15,11,15,13],[15,16,15,18],[16,6,16,8],[16,11,16,13],[18,4,18,5],[19,4,19,5],[18,14,18,15],[58,1,58,3],[58,6,58,8],[13,6,13,8],[53,4,53,5],[7,14,7,15],[8,14,8,15],[9,14,9,15],[10,14,10,15],[13,1,13,3],[55,1,55,3],[15,1,15,3],[9,4,9,5],[10,4,10,5],[11,4,11,5],[7,1,11,2],[7,4,7,5],[7,7,11,8],[8,4,8,5],[49,4,49,5],[48,6,48,8],[14,1,14,3],[14,6,14,8],[14,11,14,13],[24,11,24,13],[4,1,4,3],[57,6,57,8],[48,11,48,13],[49,1,53,2],[49,7,53,8],[48,1,48,3],[57,11,57,13],[56,1,56,3],[56,6,56,8],[4,6,4,8],[6,1,6,3],[6,6,6,8],[5,1,5,3],[5,6,5,8],[5,11,5,13],[25,1,25,3],[25,6,25,8],[24,4,24,5],[57,1,57,3],[55,6,55,8],[50,4,50,5],[51,4,51,5],[52,4,52,5],[55,4,55,5],[74,4,74,5],[70,11,76,12],[75,4,75,5],[69,6,69,8],[69,11,69,13],[59,1,63,2],[59,11,63,12],[59,7,63,8],[62,4,62,5],[59,4,59,5],[60,4,60,5],[61,4,61,5],[70,7,76,8],[3,16,3,18],[79,11,79,13],[70,17,76,18],[3,1,3,3],[3,6,3,8],[2,0,2,19],[3,14,3,15],[67,1,67,3],[67,6,67,8],[67,11,67,13],[68,1,68,3],[68,6,68,8],[68,11,68,13],[68,16,68,18],[25,11,25,13],[17,1,21,2],[16,1,16,3],[35,4,35,5],[37,1,37,3],[24,1,24,3],[36,1,36,3],[76,4,76,5],[69,1,69,3],[73,4,73,5],[3,11,3,13],[94,11,94,13],[93,6,93,8],[89,9,89,10],[83,6,89,7],[97,6,103,7],[97,12,103,13],[83,9,83,10],[84,9,84,10],[85,9,85,10],[86,9,86,10],[91,6,91,13],[96,6,96,8],[96,11,96,13],[95,6,95,8],[101,9,101,10],[102,9,102,10],[103,9,103,10],[35,11,35,13],[0,0,1,19],[73,14,73,15],[83,12,89,13],[82,11,82,13],[57,16,57,18],[49,11,53,12],[5,16,5,18],[4,11,4,13],[4,16,4,18],[6,16,6,18],[7,17,11,18],[16,16,16,18],[13,16,13,18],[6,11,6,13],[13,11,13,13],[7,11,11,12],[67,16,67,18],[66,16,66,18],[59,17,63,18],[65,0,65,19],[66,1,66,3],[66,4,66,5],[69,16,69,18],[70,1,76,2]]}
[{"$f":"INFO!B7","v":"CARABINE"}]
[]
["1/8 FINALES"]
[null,{"$f":"'Clb Q'!C4","v":"ROYAN   Les Mouettes"},null,null,"POSTE",null,{"$f":"'Clb Q'!R4","v":""},null,null,null,null,{"$f":"'Clb Q'!H22","v":""},null,null,"POSTE",null,{"$f":"'Clb Q'!M22","v":""}]
[null,{"$f":"'Clb Q'!B6","v":"CHAUVET Tiago"},null,null,3,4,{"$f":"'Clb Q'!Q6","v":""},null,null,null,null,{"$f":"'Clb Q'!G24","v":""},null,null,13,14,{"$f":"'Clb Q'!L24","v":""}]
[null,{"$f":"'Clb Q'!B7","v":"CHOTARD Hugo"},null,null,5,6,{"$f":"'Clb Q'!Q7","v":""},null,null,null,null,{"$f":"'Clb Q'!G25","v":""},null,null,15,16,{"$f":"'Clb Q'!L25","v":""}]
[null,{"$f":"'Clb Q'!B8","v":"LEYRAT Quentin"},null,null,7,8,{"$f":"'Clb Q'!Q8","v":""},null,null,null,null,{"$f":"'Clb Q'!G26","v":""},null,null,17,18,{"$f":"'Clb Q'!L26","v":""}]
[{"$f":"IF(D8=\"\",\"\",IF(D8>1,1,0))","v":""},{"$f":"IF(D8=\"\",\"\",SUM(A8:A12))","v":""},null,null,null,null,null,{"$f":"IF(G8=\"\",\"\",SUM(J8:J12))","v":""},null,{"$f":"IF(G8=\"\",\"\",IF(G8>1,1,0))","v":""},{"$f":"IF(N8=\"\",\"\",IF(N8>1,1,0))","v":""},{"$f":"IF(N8=\"\",\"\",SUM(K8:K12))","v":""},null,null,null,null,null,{"$f":"IF(Q8=\"\",\"\",SUM(T8:T12))","v":""},null,{"$f":"IF(Q8=\"\",\"\",IF(Q8>1,1,0))","v":""}]
[{"$f":"IF(D9=\"\",\"\",IF(D9>1,1,0))","v":""},null,null,null,null,null,null,null,null,{"$f":"IF(G9=\"\",\"\",IF(G9>1,1,0))","v":""},{"$f":"IF(N9=\"\",\"\",IF(N9>1,1,0))","v":""},null,null,null,null,null,null,null,null,{"$f":"IF(Q9=\"\",\"\",IF(Q9>1,1,0))","v":""}]
[{"$f":"IF(D10=\"\",\"\",IF(D10>1,1,0))","v":""},null,null,null,null,null,null,null,null,{"$f":"IF(G10=\"\",\"\",IF(G10>1,1,0))","v":""},{"$f":"IF(N10=\"\",\"\",IF(N10>1,1,0))","v":""},null,null,null,null,null,null,null,null,{"$f":"IF(Q10=\"\",\"\",IF(Q10>1,1,0))","v":""}]
{"$rows_left_out":95}
{"sheet":"PALMARES","index":5,"n_rows":46,"n_cols":13,"rows_kept":46,"cut":false,"hidden":false,"merged":[[22,9,22,12],[0,0,2,7],[3,0,3,7],[10,6,13,6],[6,6,7,6],[8,6,9,6],[14,6,21,6],[9,9,9,12]]}
[{"$f":"CONCATENATE(\"PALMARES \",INFO!C6,\"\n\",\"CHAMPIONNAT DE FRANCE DES CLUBS\nECOLE DE TIR\")","v":"PALMARES \nCHAMPIONNAT DE FRANCE DES CLUBS\nECOLE DE TIR"}]
[]
[]
[{"$f":"CONCATENATE(INFO!B7,\" - \",INFO!B9)","v":"CARABINE - POITOU-CHARENTES"}]
[]
["PLACE","CLUBS","LIGUE","n° CLUB","M Q","Bar."]
[1,{"$f":"IF(A7=\"\",\"\",IF(P.F.!G98>3,P.F.!G94,IF(P.F.!M98>3,P.F.!L94,\"\")))","v":"ROYAN   Les Mouettes"},null,{"$f":"IF(A7=\"\",\"\",VLOOKUP(B7,'M Q'!B$5:T$20,2,0))","v":1717153},{"$f":"IF(A7=\"\",\"\",VLOOKUP(B7,'M Q'!B$5:T$20,18,0))","v":441.19999999999993},{"$f":"IF(A7=\"\",\"\",VLOOKUP(B7,'M Q'!B$5:T$20,19,0))","v":0},"FINALE"]
[{"$f":"IF(INFO!B8>1,2,\"\")","v":2},{"$f":"IF(A8=\"\",\"\",IF(P.F.!G98>3,P.F.!L94,IF(P.F.!M98>3,P.F.!G94,\"\")))","v":"JONZAC   S.J.T"},null,{"$f":"IF(A8=\"\",\"\",VLOOKUP(B8,'M Q'!B$5:T$20,2,0))","v":1717165},{"$f":"IF(A8=\"\",\"\",VLOOKUP(B8,'M Q'!B$5:T$20,18,0))","v":423.7},{"$f":"IF(A8=\"\",\"\",VLOOKUP(B8,'M Q'!B$5:T$20,19,0))","v":0}]
[{"$f":"IF(INFO!B8>2,3,\"\")","v":""},{"$f":"IF(A9=\"\",\"\",IF(INFO!B8=3,P.F.!L80,IF(P.F.!G84>3,P.F.!G80,IF(P.F.!M84>3,P.F.!L80,\"\"))))","v":""},null,{"$f":"IF(A9=\"\",\"\",VLOOKUP(B9,'M Q'!B$5:T$20,2,0))","v":""},{"$f":"IF(A9=\"\",\"\",VLOOKUP(B9,'M Q'!B$5:T$20,18,0))","v":""},{"$f":"IF(A9=\"\",\"\",VLOOKUP(B9,'M Q'!B$5:T$20,19,0))","v":""},"PETITE\nFINALE"]
[{"$f":"IF(INFO!B8>3,4,\"\")","v":""},{"$f":"IF(A10=\"\",\"\",IF(P.F.!G84>3,P.F.!L80,IF(P.F.!M84>3,P.F.!G80,\"\")))","v":""},null,{"$f":"IF(A10=\"\",\"\",VLOOKUP(B10,'M Q'!B$5:T$20,2,0))","v":""},{"$f":"IF(A10=\"\",\"\",VLOOKUP(B10,'M Q'!B$5:T$20,18,0))","v":""},{"$f":"IF(A10=\"\",\"\",VLOOKUP(B10,'M Q'!B$5:T$20,19,0))","v":""},null,null,null,"1/4 finalistes sortants"]
{"$rows_left_out":36}