{"text_format":"1","workbook":"xlsx","n_sheets":6,"sheets":["INFO","saisie","M Q","Clb Q","P.F.","PALMARES"],"not_rendered":{"charts":0,"images":4,"macros":0,"external_links":0,"defined_names":6,"comments":0,"pivot_tables":0},"unopened":[],"bounds":{"document_bytes":16777216,"sheet_cells":100000,"rows_first":2000,"rows_last":500,"rows_between":2000,"halvings":0,"cell_chars":16384,"cell_head_chars":4096},"cells_cut":0,"cells_raw":0,"read":"whole","date_system":"1904"}

{"sheet":"INFO","index":0,"n_rows":19,"n_cols":3,"rows_kept":19,"cut":false,"hidden":false,"merged":[[0,0,0,2],[1,0,1,2],[15,0,15,2],[18,0,18,1],[2,0,2,2],[10,0,10,2],[16,0,16,1],[17,0,17,1]]}
["PROGRAMME DE GESTION \nCHAMPIONNAT DE FRANCE DES CLUBS\nECOLE DE TIR"]
["remplir en lettres majuscules"]
["COMPETITION"]
["date :","15 ET 16 Janvier 2022"]
["lieu :","PONS"]
["saison :","2021-2022"]
["Discipline :","CARABINE","(CARABINE ou PISTOLET)"]
["Nombre d'équipe :",2]
["Ligue :","POITOU-CHARENTES","(EN MAJUSCULE)"]
[]
["RESPONSABLE DE LA SAISIE"]
["NOM Prénom :","POISSONNET Pierre"]
["téléphone :","06 85 47 62 84"]
["adresse électronique :","gestcompte@cd-tir-17.org"]
[]
["Ce programme n'est pas protégé, je vous conseille d'en créer une copie avant utilisation afin de pallier à de possibles erreurs de manipulation. Pour tout problème lié aux règlements, veuillez consulter le document : mode d'emploi cdfc 10m.pdf.\n\nPour toute information complémentaire ou modification particulière, contacter :"]
["Monsieur Philippe QUENTEL"]
["pquentel@fftir.org"]
["01 58 05 45 32"]

{"sheet":"saisie","index":1,"n_rows":44,"n_cols":23,"rows_kept":44,"cut":false,"hidden":false,"merged":[[0,0,1,20],[2,10,2,11],[2,19,3,19],[2,20,3,20],[2,1,3,1],[2,8,3,8],[2,13,3,13],[2,18,3,18],[2,12,3,12],[2,15,2,16],[2,17,3,17],[2,0,3,0],[2,2,3,2],[2,3,3,3],[2,5,2,6],[2,7,3,7]]}
[{"$f":"CONCATENATE(INFO!B7,\" - \",INFO!B9)","v":"CARABINE - POITOU-CHARENTES"}]
[]
["POSTE","Classement\nprovisoire","CLUB","N° club","Nom","Séries",null,"Total","M*","Nom","Séries",null,"Total","M*","Nom","Séries",null,"Total","M*","TOTAL","Bar."]
[null,null,null,null,"BENJAMINS",1,2,null,null,"POUSSINS",1,2,null,null,"MINIMES",1,2]
[1,{"$f":"RANK(W5,W$5:W$44,0)","v":2},"JONZAC   S.J.T",1717165,"CRUCHET Luna",58.8,58.7,{"$f":"SUM(F5:G5)","v":117.5},null,"MIGNOT Axel",94.9,86.6,{"$f":"SUM(K5:L5)","v":181.5},null,"MILLEMONT Colline",57.4,67.3,{"$f":"SUM(P5:Q5)","v":124.69999999999999},null,{"$f":"SUM(H5+M5+R5)","v":423.7},{"$f":"I5+N5+S5","v":0},null,{"$f":"H5+M5+R5+(0.000001*(I5+N5+S5))+(0.000000001*(G5+L5+Q5))","v":423.7000002126}]
[2,{"$f":"RANK(W6,W$5:W$44,0)","v":1},"ROYAN   Les Mouettes",1717153,"CHAUVET Tiago",84.2,82,166.2,null,"CHOTARD Hugo",75.5,64.599999999999994,140.1,null,"LEYRAT Quentin",63.6,71.3,134.9,null,441.19999999999993,{"$f":"I6+N6+S6","v":0},null,{"$f":"H6+M6+R6+(0.000001*(I6+N6+S6))+(0.000000001*(G6+L6+Q6))","v":441.20000021789991}]
[3,3,null,null,null,null,null,0,null,null,null,null,0,null,null,null,null,0,null,0,0,null,0]
[4,3,null,null,null,null,null,0,null,null,null,null,0,null,null,null,null,0,null,0,0,null,0]
[5,3,null,null,null,null,null,0,null,null,null,null,0,null,null,null,null,0,null,0,0,null,0]
[6,3,null,null,null,null,null,0,null,null,null,null,0,null,null,null,null,0,null,0,0,null,0]
[7,3,null,null,null,null,null,0,null,null,null,null,0,null,null,null,null,0,null,0,0,null,0]
[8,3,null,null,null,null,null,0,null,null,null,null,0,null,null,null,null,0,null,0,0,null,0]
[9,3,null,null,null,null,null,0,null,null,null,null,0,null,null,null,null,0,null,0,0,null,0]
[10,3,null,null,null,null,null,0,null,null,null,null,0,null,null,null,null,0,null,0,0,null,0]
[11,3,null,null,null,null,null,0,null,null,null,null,0,null,null,null,null,0,null,0,0,null,0]
[12,3,null,null,null,null,null,0,null,null,null,null,0,null,null,null,null,0,null,0,0,null,0]
[13,3,null,null,null,null,null,0,null,null,null,null,0,null,null,null,null,0,null,0,0,null,0]
[14,3,null,null,null,null,null,0,null,null,null,null,0,null,null,null,null,0,null,0,0,null,0]
[15,3,null,null,null,null,null,0,null,null,null,null,0,null,null,null,null,0,null,0,0,null,0]
[16,3,null,null,null,null,null,0,null,null,null,null,0,null,null,null,null,0,null,0,0,null,0]
[17,3,null,null,null,null,null,0,null,null,null,null,0,null,null,null,null,0,null,0,0,null,0]
[18,3,null,null,null,null,null,0,null,null,null,null,0,null,null,null,null,0,null,0,0,null,0]
[19,3,null,null,null,null,null,0,null,null,null,null,0,null,null,null,null,0,null,0,0,null,0]
[20,3,null,null,null,null,null,0,null,null,null,null,0,null,null,null,null,0,null,0,0,null,0]
[21,3,null,null,null,null,null,0,null,null,null,null,0,null,null,null,null,0,null,0,0,null,0]
[22,3,null,null,null,null,null,0,null,null,null,null,0,null,null,null,null,0,null,0,0,null,0]
[23,3,null,null,null,null,null,0,null,null,null,null,0,null,null,null,null,0,null,0,0,null,0]
[24,3,null,null,null,null,null,0,null,null,null,null,0,null,null,null,null,0,null,0,0,null,0]
[25,3,null,null,null,null,null,0,null,null,null,null,0,null,null,null,null,0,null,0,0,null,0]
[26,3,null,null,null,null,null,0,null,null,null,null,0,null,null,null,null,0,null,0,0,null,0]
[27,3,null,null,null,null,null,0,null,null,null,null,0,null,null,null,null,0,null,0,0,null,0]
[28,3,null,null,null,null,null,0,null,null,null,null,0,null,null,null,null,0,null,0,0,null,0]
[29,3,null,null,null,null,null,0,null,null,null,null,0,null,null,null,null,0,null,0,0,null,0]
[30,3,null,null,null,null,null,0,null,null,null,null,0,null,null,null,null,0,null,0,0,null,0]
[31,3,null,null,null,null,null,0,null,null,null,null,0,null,null,null,null,0,null,0,0,null,0]
[32,3,null,null,null,null,null,0,null,null,null,null,0,null,null,null,null,0,null,0,0,null,0]
[33,3,null,null,null,null,null,0,null,null,null,null,0,null,null,null,null,0,null,0,0,null,0]
[34,3,null,null,null,null,null,0,null,null,null,null,0,null,null,null,null,0,null,0,0,null,0]
[35,3,null,null,null,null,null,0,null,null,null,null,0,null,null,null,null,0,null,0,0,null,0]
[36,3,null,null,null,null,null,0,null,null,null,null,0,null,null,null,null,0,null,0,0,null,0]
[37,3,null,null,null,null,null,0,null,null,null,null,0,null,null,null,null,0,null,0,0,null,0]
[38,3,null,null,null,null,null,0,null,null,null,null,0,null,null,null,null,0,null,0,0,null,0]
[39,3,null,null,null,null,null,0,null,null,null,null,0,null,null,null,null,0,null,0,0,null,0]
[40,3,null,null,null,null,null,0,null,null,null,null,0,null,null,null,null,0,null,0,0,null,0]

{"sheet":"M Q","index":2,"n_rows":44,"n_cols":20,"rows_kept":44,"cut":false,"hidden":false,"merged":[[1,0,1,19],[2,4,2,5],[2,9,2,10],[2,14,2,15],[2,0,3,0],[2,6,3,6],[2,19,3,19],[2,1,3,1],[2,11,3,11],[2,16,3,16],[2,18,3,18],[2,2,3,2],[2,7,3,7],[2,12,3,12],[2,17,3,17]]}
[]
[{"$f":"CONCATENATE(\"MATCH DE QUALIFICATION\",\" - \",INFO!B7,\" - \",INFO!B9)","v":"MATCH DE QUALIFICATION - CARABINE - POITOU-CHARENTES"}]
["Cl.","CLUB","N° club","Nom","Séries",null,"Total","M*","Nom","Séries",null,"Total","M*","Nom","Séries",null,"Total","M*","TOTAL","Bar."]
[null,null,null,"BENJAMINS",1,2,null,null,"POUSSINS",1,2,null,null,"MINIMES",1,2]
[1,{"$f":"VLOOKUP(A5,saisie!B$5:W$44,2,0)","v":"ROYAN   Les Mouettes"},{"$f":"VLOOKUP(A5,saisie!B$5:W$44,3,0)","v":1717153},{"$f":"VLOOKUP(A5,saisie!B$5:W$44,4,0)","v":"CHAUVET Tiago"},{"$f":"VLOOKUP(A5,saisie!B$5:W$44,5,0)","v":84.2},{"$f":"VLOOKUP(A5,saisie!B$5:W$44,6,0)","v":82},{"$f":"SUM(E5:F5)","v":166.2},{"$f":"VLOOKUP(A5,saisie!B$5:W$44,8,0)","v":0},{"$f":"VLOOKUP(A5,saisie!B$5:W$44,9,0)","v":"CHOTARD Hugo"},{"$f":"VLOOKUP(A5,saisie!B$5:W$44,10,0)","v":75.5},{"$f":"VLOOKUP(A5,saisie!B$5:W$44,11,0)","v":64.599999999999994},{"$f":"SUM(J5:K5)","v":140.1},{"$f":"VLOOKUP(A5,saisie!B$5:W$44,13,0)","v":0},{"$f":"VLOOKUP(A5,saisie!B$5:W$44,14,0)","v":"LEYRAT Quentin"},{"$f":"VLOOKUP(A5,saisie!B$5:W$44,15,0)","v":63.6},{"$f":"VLOOKUP(A5,saisie!B$5:W$44,16,0)","v":71.3},{"$f":"SUM(O5:P5)","v":134.9},{"$f":"VLOOKUP(A5,saisie!B$5:W$44,18,0)","v":0},{"$f":"SUM(G5+L5+Q5)","v":441.19999999999993},{"$f":"VLOOKUP(A5,saisie!B$5:W$44,20,0)","v":0}]
[{"$f":"IF(INFO!B8>1,2,\"\")","v":2},{"$f":"VLOOKUP(A6,saisie!B$5:W$44,2,0)","v":"JONZAC   S.J.T"},{"$f":"VLOOKUP(A6,saisie!B$5:W$44,3,0)","v":1717165},{"$f":"VLOOKUP(A6,saisie!B$5:W$44,4,0)","v":"CRUCHET Luna"},{"$f":"VLOOKUP(A6,saisie!B$5:W$44,5,0)","v":58.8},{"$f":"VLOOKUP(A6,saisie!B$5:W$44,6,0)","v":58.7},117.5,{"$f":"VLOOKUP(A6,saisie!B$5:W$44,8,0)","v":0},{"$f":"VLOOKUP(A6,saisie!B$5:W$44,9,0)","v":"MIGNOT Axel"},{"$f":"VLOOKUP(A6,saisie!B$5:W$44,10,0)","v":94.9},{"$f":"VLOOKUP(A6,saisie!B$5:W$44,11,0)","v":86.6},181.5,{"$f":"VLOOKUP(A6,saisie!B$5:W$44,13,0)","v":0},{"$f":"VLOOKUP(A6,saisie!B$5:W$44,14,0)","v":"MILLEMONT Colline"},{"$f":"VLOOKUP(A6,saisie!B$5:W$44,15,0)","v":57.4},{"$f":"VLOOKUP(A6,saisie!B$5:W$44,16,0)","v":67.3},124.69999999999999,{"$f":"VLOOKUP(A6,saisie!B$5:W$44,18,0)","v":0},423.7,{"$f":"VLOOKUP(A6,saisie!B$5:W$44,20,0)","v":0}]
[{"$f":"IF(INFO!B8>2,3,\"\")","v":""},{"$f":"VLOOKUP(A7,saisie!B$5:W$44,2,0)","v":{"$error":"#N/A"}},{"$f":"VLOOKUP(A7,saisie!B$5:W$44,3,0)","v":{"$error":"#N/A"}},{"$f":"VLOOKUP(A7,saisie!B$5:W$44,4,0)","v":{"$error":"#N/A"}},{"$f":"VLOOKUP(A7,saisie!B$5:W$44,5,0)","v":{"$error":"#N/A"}},{"$f":"VLOOKUP(A7,saisie!B$5:W$44,6,0)","v":{"$error":"#N/A"}},{"$error":"#N/A"},{"$f":"VLOOKUP(A7,saisie!B$5:W$44,8,0)","v":{"$error":"#N/A"}},{"$f":"VLOOKUP(A7,saisie!B$5:W$44,9,0)","v":{"$error":"#N/A"}},{"$f":"VLOOKUP(A7,saisie!B$5:W$44,10,0)","v":{"$error":"#N/A"}},{"$f":"VLOOKUP(A7,saisie!B$5:W$44,11,0)","v":{"$error":"#N/A"}},{"$error":"#N/A"},{"$f":"VLOOKUP(A7,saisie!B$5:W$44,13,0)","v":{"$error":"#N/A"}},{"$f":"VLOOKUP(A7,saisie!B$5:W$44,14,0)","v":{"$error":"#N/A"}},{"$f":"VLOOKUP(A7,saisie!B$5:W$44,15,0)","v":{"$error":"#N/A"}},{"$f":"VLOOKUP(A7,saisie!B$5:W$44,16,0)","v":{"$error":"#N/A"}},{"$error":"#N/A"},{"$f":"VLOOKUP(A7,saisie!B$5:W$44,18,0)","v":{"$error":"#N/A"}},{"$error":"#N/A"},{"$f":"VLOOKUP(A7,saisie!B$5:W$44,20,0)","v":{"$error":"#N/A"}}]
[{"$f":"IF(INFO!B8>3,4,\"\")","v":""},{"$f":"VLOOKUP(A8,saisie!B$5:W$44,2,0)","v":{"$error":"#N/A"}},{"$f":"VLOOKUP(A8,saisie!B$5:W$44,3,0)","v":{"$error":"#N/A"}},{"$f":"VLOOKUP(A8,saisie!B$5:W$44,4,0)","v":{"$error":"#N/A"}},{"$f":"VLOOKUP(A8,saisie!B$5:W$44,5,0)","v":{"$error":"#N/A"}},{"$f":"VLOOKUP(A8,saisie!B$5:W$44,6,0)","v":{"$error":"#N/A"}},{"$error":"#N/A"},{"$f":"VLOOKUP(A8,saisie!B$5:W$44,8,0)","v":{"$error":"#N/A"}},{"$f":"VLOOKUP(A8,saisie!B$5:W$44,9,0)","v":{"$error":"#N/A"}},{"$f":"VLOOKUP(A8,saisie!B$5:W$44,10,0)","v":{"$error":"#N/A"}},{"$f":"VLOOKUP(A8,saisie!B$5:W$44,11,0)","v":{"$error":"#N/A"}},{"$error":"#N/A"},{"$f":"VLOOKUP(A8,saisie!B$5:W$44,13,0)","v":{"$error":"#N/A"}},{"$f":"VLOOKUP(A8,saisie!B$5:W$44,14,0)","v":{"$error":"#N/A"}},{"$f":"VLOOKUP(A8,saisie!B$5:W$44,15,0)","v":{"$error":"#N/A"}},{"$f":"VLOOKUP(A8,saisie!B$5:W$44,16,0)","v":{"$error":"#N/A"}},{"$error":"#N/A"},{"$f":"VLOOKUP(A8,saisie!B$5:W$44,18,0)","v":{"$error":"#N/A"}},{"$error":"#N/A"},{"$f":"VLOOKUP(A8,saisie!B$5:W$44,20,0)","v":{"$error":"#N/A"}}]
[{"$f":"IF(INFO!B8>4,5,\"\")","v":""},{"$f":"VLOOKUP(A9,saisie!B$5:W$44,2,0)","v":{"$error":"#N/A"}},{"$f":"VLOOKUP(A9,saisie!B$5:W$44,3,0)","v":{"$error":"#N/A"}},{"$f":"VLOOKUP(A9,saisie!B$5:W$44,4,0)","v":{"$error":"#N/A"}},{"$f":"VLOOKUP(A9,saisie!B$5:W$44,5,0)","v":{"$error":"#N/A"}},{"$f":"VLOOKUP(A9,saisie!B$5:W$44,6,0)","v":{"$error":"#N/A"}},{"$error":"#N/A"},{"$f":"VLOOKUP(A9,saisie!B$5:W$44,8,0)","v":{"$error":"#N/A"}},{"$f":"VLOOKUP(A9,saisie!B$5:W$44,9,0)","v":{"$error":"#N/A"}},{"$f":"VLOOKUP(A9,saisie!B$5:W$44,10,0)","v":{"$error":"#N/A"}},{"$f":"VLOOKUP(A9,saisie!B$5:W$44,11,0)","v":{"$error":"#N/A"}},{"$error":"#N/A"},{"$f":"VLOOKUP(A9,saisie!B$5:W$44,13,0)","v":{"$error":"#N/A"}},{"$f":"VLOOKUP(A9,saisie!B$5:W$44,14,0)","v":{"$error":"#N/A"}},{"$f":"VLOOKUP(A9,saisie!B$5:W$44,15,0)","v":{"$error":"#N/A"}},{"$f":"VLOOKUP(A9,saisie!B$5:W$44,16,0)","v":{"$error":"#N/A"}},{"$error":"#N/A"},{"$f":"VLOOKUP(A9,saisie!B$5:W$44,18,0)","v":{"$error":"#N/A"}},{"$error":"#N/A"},{"$f":"VLOOKUP(A9,saisie!B$5:W$44,20,0)","v":{"$error":"#N/A"}}]
[{"$f":"IF(INFO!B8>5,6,\"\")","v":""},{"$f":"VLOOKUP(A10,saisie!B$5:W$44,2,0)","v":{"$error":"#N/A"}},{"$f":"VLOOKUP(A10,saisie!B$5:W$44,3,0)","v":{"$error":"#N/A"}},{"$f":"VLOOKUP(A10,saisie!B$5:W$44,4,0)","v":{"$error":"#N/A"}},{"$f":"VLOOKUP(A10,saisie!B$5:W$44,5,0)","v":{"$error":"#N/A"}},{"$f":"VLOOKUP(A10,saisie!B$5:W$44,6,0)","v":{"$error":"#N/A"}},{"$error":"#N/A"},{"$f":"VLOOKUP(A10,saisie!B$5:W$44,8,0)","v":{"$error":"#N/A"}},{"$f":"VLOOKUP(A10,saisie!B$5:W$44,9,0)","v":{"$error":"#N/A"}},{"$f":"VLOOKUP(A10,saisie!B$5:W$44,10,0)","v":{"$error":"#N/A"}},{"$f":"VLOOKUP(A10,saisie!B$5:W$44,11,0)","v":{"$error":"#N/A"}},{"$error":"#N/A"},{"$f":"VLOOKUP(A10,saisie!B$5:W$44,13,0)","v":{"$error":"#N/A"}},{"$f":"VLOOKUP(A10,saisie!B$5:W$44,14,0)","v":{"$error":"#N/A"}},{"$f":"VLOOKUP(A10,saisie!B$5:W$44,15,0)","v":{"$error":"#N/A"}},{"$f":"VLOOKUP(A10,saisie!B$5:W$44,16,0)","v":{"$error":"#N/A"}},{"$error":"#N/A"},{"$f":"VLOOKUP(A10,saisie!B$5:W$44,18,0)","v":{"$error":"#N/A"}},{"$error":"#N/A"},{"$f":"VLOOKUP(A10,saisie!B$5:W$44,20,0)","v":{"$error":"#N/A"}}]
[{"$f":"IF(INFO!B8>6,7,\"\")","v":""},{"$f":"VLOOKUP(A11,saisie!B$5:W$44,2,0)","v":{"$error":"#N/A"}},{"$f":"VLOOKUP(A11,saisie!B$5:W$44,3,0)","v":{"$error":"#N/A"}},{"$f":"VLOOKUP(A11,saisie!B$5:W$44,4,0)","v":{"$error":"#N/A"}},{"$f":"VLOOKUP(A11,saisie!B$5:W$44,5,0)","v":{"$error":"#N/A"}},{"$f":"VLOOKUP(A11,saisie!B$5:W$44,6,0)","v":{"$error":"#N/A"}},{"$error":"#N/A"},{"$f":"VLOOKUP(A11,saisie!B$5:W$44,8,0)","v":{"$error":"#N/A"}},{"$f":"VLOOKUP(A11,saisie!B$5:W$44,9,0)","v":{"$error":"#N/A"}},{"$f":"VLOOKUP(A11,saisie!B$5:W$44,10,0)","v":{"$error":"#N/A"}},{"$f":"VLOOKUP(A11,saisie!B$5:W$44,11,0)","v":{"$error":"#N/A"}},{"$error":"#N/A"},{"$f":"VLOOKUP(A11,saisie!B$5:W$44,13,0)","v":{"$error":"#N/A"}},{"$f":"VLOOKUP(A11,saisie!B$5:W$44,14,0)","v":{"$error":"#N/A"}},{"$f":"VLOOKUP(A11,saisie!B$5:W$44,15,0)","v":{"$error":"#N/A"}},{"$f":"VLOOKUP(A11,saisie!B$5:W$44,16,0)","v":{"$error":"#N/A"}},{"$error":"#N/A"},{"$f":"VLOOKUP(A11,saisie!B$5:W$44,18,0)","v":{"$error":"#N/A"}},{"$error":"#N/A"},{"$f":"VLOOKUP(A11,saisie!B$5:W$44,20,0)","v":{"$error":"#N/A"}}]
[{"$f":"IF(INFO!B8>7,8,\"\")","v":""},{"$f":"VLOOKUP(A12,saisie!B$5:W$44,2,0)","v":{"$error":"#N/A"}},{"$f":"VLOOKUP(A12,saisie!B$5:W$44,3,0)","v":{"$error":"#N/A"}},{"$f":"VLOOKUP(A12,saisie!B$5:W$44,4,0)","v":{"$error":"#N/A"}},{"$f":"VLOOKUP(A12,saisie!B$5:W$44,5,0)","v":{"$error":"#N/A"}},{"$f":"VLOOKUP(A12,saisie!B$5:W$44,6,0)","v":{"$error":"#N/A"}},{"$error":"#N/A"},{"$f":"VLOOKUP(A12,saisie!B$5:W$44,8,0)","v":{"$error":"#N/A"}},{"$f":"VLOOKUP(A12,saisie!B$5:W$44,9,0)","v":{"$error":"#N/A"}},{"$f":"VLOOKUP(A12,saisie!B$5:W$44,10,0)","v":{"$error":"#N/A"}},{"$f":"VLOOKUP(A12,saisie!B$5:W$44,11,0)","v":{"$error":"#N/A"}},{"$error":"#N/A"},{"$f":"VLOOKUP(A12,saisie!B$5:W$44,13,0)","v":{"$error":"#N/A"}},{"$f":"VLOOKUP(A12,saisie!B$5:W$44,14,0)","v":{"$error":"#N/A"}},{"$f":"VLOOKUP(A12,saisie!B$5:W$44,15,0)","v":{"$error":"#N/A"}},{"$f":"VLOOKUP(A12,saisie!B$5:W$44,16,0)","v":{"$error":"#N/A"}},{"$error":"#N/A"},{"$f":"VLOOKUP(A12,saisie!B$5:W$44,18,0)","v":{"$error":"#N/A"}},{"$error":"#N/A"},{"$f":"VLOOKUP(A12,saisie!B$5:W$44,20,0)","v":{"$error":"#N/A"}}]
[{"$f":"IF(INFO!B8>8,9,\"\")","v":""},{"$f":"VLOOKUP(A13,saisie!B$5:W$44,2,0)","v":{"$error":"#N/A"}},{"$f":"VLOOKUP(A13,saisie!B$5:W$44,3,0)","v":{"$error":"#N/A"}},{"$f":"VLOOKUP(A13,saisie!B$5:W$44,4,0)","v":{"$error":"#N/A"}},{"$f":"VLOOKUP(A13,saisie!B$5:W$44,5,0)","v":{"$error":"#N/A"}},{"$f":"VLOOKUP(A13,saisie!B$5:W$44,6,0)","v":{"$error":"#N/A"}},{"$error":"#N/A"},{"$f":"VLOOKUP(A13,saisie!B$5:W$44,8,0)","v":{"$error":"#N/A"}},{"$f":"VLOOKUP(A13,saisie!B$5:W$44,9,0)","v":{"$error":"#N/A"}},{"$f":"VLOOKUP(A13,saisie!B$5:W$44,10,0)","v":{"$error":"#N/A"}},{"$f":"VLOOKUP(A13,saisie!B$5:W$44,11,0)","v":{"$error":"#N/A"}},{"$error":"#N/A"},{"$f":"VLOOKUP(A13,saisie!B$5:W$44,13,0)","v":{"$error":"#N/A"}},{"$f":"VLOOKUP(A13,saisie!B$5:W$44,14,0)","v":{"$error":"#N/A"}},{"$f":"VLOOKUP(A13,saisie!B$5:W$44,15,0)","v":{"$error":"#N/A"}},{"$f":"VLOOKUP(A13,saisie!B$5:W$44,16,0)","v":{"$error":"#N/A"}},{"$error":"#N/A"},{"$f":"VLOOKUP(A13,saisie!B$5:W$44,18,0)","v":{"$error":"#N/A"}},{"$error":"#N/A"},{"$f":"VLOOKUP(A13,saisie!B$5:W$44,20,0)","v":{"$error":"#N/A"}}]
[{"$f":"IF(INFO!B8>9,10,\"\")","v":""},{"$f":"VLOOKUP(A14,saisie!B$5:W$44,2,0)","v":{"$error":"#N/A"}},{"$f":"VLOOKUP(A14,saisie!B$5:W$44,3,0)","v":{"$error":"#N/A"}},{"$f":"VLOOKUP(A14,saisie!B$5:W$44,4,0)","v":{"$error":"#N/A"}},{"$f":"VLOOKUP(A14,saisie!B$5:W$44,5,0)","v":{"$error":"#N/A"}},{"$f":"VLOOKUP(A14,saisie!B$5:W$44,6,0)","v":{"$error":"#N/A"}},{"$error":"#N/A"},{"$f":"VLOOKUP(A14,saisie!B$5:W$44,8,0)","v":{"$error":"#N/A"}},{"$f":"VLOOKUP(A14,saisie!B$5:W$44,9,0)","v":{"$error":"#N/A"}},{"$f":"VLOOKUP(A14,saisie!B$5:W$44,10,0)","v":{"$error":"#N/A"}},{"$f":"VLOOKUP(A14,saisie!B$5:W$44,11,0)","v":{"$error":"#N/A"}},{"$error":"#N/A"},{"$f":"VLOOKUP(A14,saisie!B$5:W$44,13,0)","v":{"$error":"#N/A"}},{"$f":"VLOOKUP(A14,saisie!B$5:W$44,14,0)","v":{"$error":"#N/A"}},{"$f":"VLOOKUP(A14,saisie!B$5:W$44,15,0)","v":{"$error":"#N/A"}},{"$f":"VLOOKUP(A14,saisie!B$5:W$44,16,0)","v":{"$error":"#N/A"}},{"$error":"#N/A"},{"$f":"VLOOKUP(A14,saisie!B$5:W$44,18,0)","v":{"$error":"#N/A"}},{"$error":"#N/A"},{"$f":"VLOOKUP(A14,saisie!B$5:W$44,20,0)","v":{"$error":"#N/A"}}]
[{"$f":"IF(INFO!B8>10,11,\"\")","v":""},{"$f":"VLOOKUP(A15,saisie!B$5:W$44,2,0)","v":{"$error":"#N/A"}},{"$f":"VLOOKUP(A15,saisie!B$5:W$44,3,0)","v":{"$error":"#N/A"}},{"$f":"VLOOKUP(A15,saisie!B$5:W$44,4,0)","v":{"$error":"#N/A"}},{"$f":"VLOOKUP(A15,saisie!B$5:W$44,5,0)","v":{"$error":"#N/A"}},{"$f":"VLOOKUP(A15,saisie!B$5:W$44,6,0)","v":{"$error":"#N/A"}},{"$error":"#N/A"},{"$f":"VLOOKUP(A15,saisie!B$5:W$44,8,0)","v":{"$error":"#N/A"}},{"$f":"VLOOKUP(A15,saisie!B$5:W$44,9,0)","v":{"$error":"#N/A"}},{"$f":"VLOOKUP(A15,saisie!B$5:W$44,10,0)","v":{"$error":"#N/A"}},{"$f":"VLOOKUP(A15,saisie!B$5:W$44,11,0)","v":{"$error":"#N/A"}},{"$error":"#N/A"},{"$f":"VLOOKUP(A15,saisie!B$5:W$44,13,0)","v":{"$error":"#N/A"}},{"$f":"VLOOKUP(A15,saisie!B$5:W$44,14,0)","v":{"$error":"#N/A"}},{"$f":"VLOOKUP(A15,saisie!B$5:W$44,15,0)","v":{"$error":"#N/A"}},{"$f":"VLOOKUP(A15,saisie!B$5:W$44,16,0)","v":{"$error":"#N/A"}},{"$error":"#N/A"},{"$f":"VLOOKUP(A15,saisie!B$5:W$44,18,0)","v":{"$error":"#N/A"}},{"$error":"#N/A"},{"$f":"VLOOKUP(A15,saisie!B$5:W$44,20,0)","v":{"$error":"#N/A"}}]
[{"$f":"IF(INFO!B8>11,12,\"\")","v":""},{"$f":"VLOOKUP(A16,saisie!B$5:W$44,2,0)","v":{"$error":"#N/A"}},{"$f":"VLOOKUP(A16,saisie!B$5:W$44,3,0)","v":{"$error":"#N/A"}},{"$f":"VLOOKUP(A16,saisie!B$5:W$44,4,0)","v":{"$error":"#N/A"}},{"$f":"VLOOKUP(A16,saisie!B$5:W$44,5,0)","v":{"$error":"#N/A"}},{"$f":"VLOOKUP(A16,saisie!B$5:W$44,6,0)","v":{"$error":"#N/A"}},{"$error":"#N/A"},{"$f":"VLOOKUP(A16,saisie!B$5:W$44,8,0)","v":{"$error":"#N/A"}},{"$f":"VLOOKUP(A16,saisie!B$5:W$44,9,0)","v":{"$error":"#N/A"}},{"$f":"VLOOKUP(A16,saisie!B$5:W$44,10,0)","v":{"$error":"#N/A"}},{"$f":"VLOOKUP(A16,saisie!B$5:W$44,11,0)","v":{"$error":"#N/A"}},{"$error":"#N/A"},{"$f":"VLOOKUP(A16,saisie!B$5:W$44,13,0)","v":{"$error":"#N/A"}},{"$f":"VLOOKUP(A16,saisie!B$5:W$44,14,0)","v":{"$error":"#N/A"}},{"$f":"VLOOKUP(A16,saisie!B$5:W$44,15,0)","v":{"$error":"#N/A"}},{"$f":"VLOOKUP(A16,saisie!B$5:W$44,16,0)","v":{"$error":"#N/A"}},{"$error":"#N/A"},{"$f":"VLOOKUP(A16,saisie!B$5:W$44,18,0)","v":{"$error":"#N/A"}},{"$error":"#N/A"},{"$f":"VLOOKUP(A16,saisie!B$5:W$44,20,0)","v":{"$error":"#N/A"}}]
[{"$f":"IF(INFO!B8>12,13,\"\")","v":""},{"$f":"VLOOKUP(A17,saisie!B$5:W$44,2,0)","v":{"$error":"#N/A"}},{"$f":"VLOOKUP(A17,saisie!B$5:W$44,3,0)","v":{"$error":"#N/A"}},{"$f":"VLOOKUP(A17,saisie!B$5:W$44,4,0)","v":{"$error":"#N/A"}},{"$f":"VLOOKUP(A17,saisie!B$5:W$44,5,0)","v":{"$error":"#N/A"}},{"$f":"VLOOKUP(A17,saisie!B$5:W$44,6,0)","v":{"$error":"#N/A"}},{"$error":"#N/A"},{"$f":"VLOOKUP(A17,saisie!B$5:W$44,8,0)","v":{"$error":"#N/A"}},{"$f":"VLOOKUP(A17,saisie!B$5:W$44,9,0)","v":{"$error":"#N/A"}},{"$f":"VLOOKUP(A17,saisie!B$5:W$44,10,0)","v":{"$error":"#N/A"}},{"$f":"VLOOKUP(A17,saisie!B$5:W$44,11,0)","v":{"$error":"#N/A"}},{"$error":"#N/A"},{"$f":"VLOOKUP(A17,saisie!B$5:W$44,13,0)","v":{"$error":"#N/A"}},{"$f":"VLOOKUP(A17,saisie!B$5:W$44,14,0)","v":{"$error":"#N/A"}},{"$f":"VLOOKUP(A17,saisie!B$5:W$44,15,0)","v":{"$error":"#N/A"}},{"$f":"VLOOKUP(A17,saisie!B$5:W$44,16,0)","v":{"$error":"#N/A"}},{"$error":"#N/A"},{"$f":"VLOOKUP(A17,saisie!B$5:W$44,18,0)","v":{"$error":"#N/A"}},{"$error":"#N/A"},{"$f":"VLOOKUP(A17,saisie!B$5:W$44,20,0)","v":{"$error":"#N/A"}}]
[{"$f":"IF(INFO!B8>13,14,\"\")","v":""},{"$f":"VLOOKUP(A18,saisie!B$5:W$44,2,0)","v":{"$error":"#N/A"}},{"$f":"VLOOKUP(A18,saisie!B$5:W$44,3,0)","v":{"$error":"#N/A"}},{"$f":"VLOOKUP(A18,saisie!B$5:W$44,4,0)","v":{"$error":"#N/A"}},{"$f":"VLOOKUP(A18,saisie!B$5:W$44,5,0)","v":{"$error":"#N/A"}},{"$f":"VLOOKUP(A18,saisie!B$5:W$44,6,0)","v":{"$error":"#N/A"}},{"$error":"#N/A"},{"$f":"VLOOKUP(A18,saisie!B$5:W$44,8,0)","v":{"$error":"#N/A"}},{"$f":"VLOOKUP(A18,saisie!B$5:W$44,9,0)","v":{"$error":"#N/A"}},{"$f":"VLOOKUP(A18,saisie!B$5:W$44,10,0)","v":{"$error":"#N/A"}},{"$f":"VLOOKUP(A18,saisie!B$5:W$44,11,0)","v":{"$error":"#N/A"}},{"$error":"#N/A"},{"$f":"VLOOKUP(A18,saisie!B$5:W$44,13,0)","v":{"$error":"#N/A"}},{"$f":"VLOOKUP(A18,saisie!B$5:W$44,14,0)","v":{"$error":"#N/A"}},{"$f":"VLOOKUP(A18,saisie!B$5:W$44,15,0)","v":{"$error":"#N/A"}},{"$f":"VLOOKUP(A18,saisie!B$5:W$44,16,0)","v":{"$error":"#N/A"}},{"$error":"#N/A"},{"$f":"VLOOKUP(A18,saisie!B$5:W$44,18,0)","v":{"$error":"#N/A"}},{"$error":"#N/A"},{"$f":"VLOOKUP(A18,saisie!B$5:W$44,20,0)","v":{"$error":"#N/A"}}]
[{"$f":"IF(INFO!B8>14,15,\"\")","v":""},{"$f":"VLOOKUP(A19,saisie!B$5:W$44,2,0)","v":{"$error":"#N/A"}},{"$f":"VLOOKUP(A19,saisie!B$5:W$44,3,0)","v":{"$error":"#N/A"}},{"$f":"VLOOKUP(A19,saisie!B$5:W$44,4,0)","v":{"$error":"#N/A"}},{"$f":"VLOOKUP(A19,saisie!B$5:W$44,5,0)","v":{"$error":"#N/A"}},{"$f":"VLOOKUP(A19,saisie!B$5:W$44,6,0)","v":{"$error":"#N/A"}},{"$error":"#N/A"},{"$f":"VLOOKUP(A19,saisie!B$5:W$44,8,0)","v":{"$error":"#N/A"}},{"$f":"VLOOKUP(A19,saisie!B$5:W$44,9,0)","v":{"$error":"#N/A"}},{"$f":"VLOOKUP(A19,saisie!B$5:W$44,10,0)","v":{"$error":"#N/A"}},{"$f":"VLOOKUP(A19,saisie!B$5:W$44,11,0)","v":{"$error":"#N/A"}},{"$error":"#N/A"},{"$f":"VLOOKUP(A19,saisie!B$5:W$44,13,0)","v":{"$error":"#N/A"}},{"$f":"VLOOKUP(A19,saisie!B$5:W$44,14,0)","v":{"$error":"#N/A"}},{"$f":"VLOOKUP(A19,saisie!B$5:W$44,15,0)","v":{"$error":"#N/A"}},{"$f":"VLOOKUP(A19,saisie!B$5:W$44,16,0)","v":{"$error":"#N/A"}},{"$error":"#N/A"},{"$f":"VLOOKUP(A19,saisie!B$5:W$44,18,0)","v":{"$error":"#N/A"}},{"$error":"#N/A"},{"$f":"VLOOKUP(A19,saisie!B$5:W$44,20,0)","v":{"$error":"#N/A"}}]
[{"$f":"IF(INFO!B8>15,16,\"\")","v":""},{"$f":"VLOOKUP(A20,saisie!B$5:W$44,2,0)","v":{"$error":"#N/A"}},{"$f":"VLOOKUP(A20,saisie!B$5:W$44,3,0)","v":{"$error":"#N/A"}},{"$f":"VLOOKUP(A20,saisie!B$5:W$44,4,0)","v":{"$error":"#N/A"}},{"$f":"VLOOKUP(A20,saisie!B$5:W$44,5,0)","v":{"$error":"#N/A"}},{"$f":"VLOOKUP(A20,saisie!B$5:W$44,6,0)","v":{"$error":"#N/A"}},{"$error":"#N/A"},{"$f":"VLOOKUP(A20,saisie!B$5:W$44,8,0)","v":{"$error":"#N/A"}},{"$f":"VLOOKUP(A20,saisie!B$5:W$44,9,0)","v":{"$error":"#N/A"}},{"$f":"VLOOKUP(A20,saisie!B$5:W$44,10,0)","v":{"$error":"#N/A"}},{"$f":"VLOOKUP(A20,saisie!B$5:W$44,11,0)","v":{"$error":"#N/A"}},{"$error":"#N/A"},{"$f":"VLOOKUP(A20,saisie!B$5:W$44,13,0)","v":{"$error":"#N/A"}},{"$f":"VLOOKUP(A20,saisie!B$5:W$44,14,0)","v":{"$error":"#N/A"}},{"$f":"VLOOKUP(A20,saisie!B$5:W$44,15,0)","v":{"$error":"#N/A"}},{"$f":"VLOOKUP(A20,saisie!B$5:W$44,16,0)","v":{"$error":"#N/A"}},{"$error":"#N/A"},{"$f":"VLOOKUP(A20,saisie!B$5:W$44,18,0)","v":{"$error":"#N/A"}},{"$error":"#N/A"},{"$f":"VLOOKUP(A20,saisie!B$5:W$44,20,0)","v":{"$error":"#N/A"}}]
[{"$f":"IF(INFO!B8>16,17,\"\")","v":""},{"$f":"VLOOKUP(A21,saisie!B$5:W$44,2,0)","v":{"$error":"#N/A"}},{"$f":"VLOOKUP(A21,saisie!B$5:W$44,3,0)","v":{"$error":"#N/A"}},{"$f":"VLOOKUP(A21,saisie!B$5:W$44,4,0)","v":{"$error":"#N/A"}},{"$f":"VLOOKUP(A21,saisie!B$5:W$44,5,0)","v":{"$error":"#N/A"}},{"$f":"VLOOKUP(A21,saisie!B$5:W$44,6,0)","v":{"$error":"#N/A"}},{"$error":"#N/A"},{"$f":"VLOOKUP(A21,saisie!B$5:W$44,8,0)","v":{"$error":"#N/A"}},{"$f":"VLOOKUP(A21,saisie!B$5:W$44,9,0)","v":{"$error":"#N/A"}},{"$f":"VLOOKUP(A21,saisie!B$5:W$44,10,0)","v":{"$error":"#N/A"}},{"$f":"VLOOKUP(A21,saisie!B$5:W$44,11,0)","v":{"$error":"#N/A"}},{"$error":"#N/A"},{"$f":"VLOOKUP(A21,saisie!B$5:W$44,13,0)","v":{"$error":"#N/A"}},{"$f":"VLOOKUP(A21,saisie!B$5:W$44,14,0)","v":{"$error":"#N/A"}},{"$f":"VLOOKUP(A21,saisie!B$5:W$44,15,0)","v":{"$error":"#N/A"}},{"$f":"VLOOKUP(A21,saisie!B$5:W$44,16,0)","v":{"$error":"#N/A"}},{"$error":"#N/A"},{"$f":"VLOOKUP(A21,saisie!B$5:W$44,18,0)","v":{"$error":"#N/A"}},{"$error":"#N/A"},{"$f":"VLOOKUP(A21,saisie!B$5:W$44,20,0)","v":{"$error":"#N/A"}}]
[{"$f":"IF(INFO!B8>17,18,\"\")","v":""},{"$f":"VLOOKUP(A22,saisie!B$5:W$44,2,0)","v":{"$error":"#N/A"}},{"$f":"VLOOKUP(A22,saisie!B$5:W$44,3,0)","v":{"$error":"#N/A"}},{"$f":"VLOOKUP(A22,saisie!B$5:W$44,4,0)","v":{"$error":"#N/A"}},{"$f":"VLOOKUP(A22,saisie!B$5:W$44,5,0)","v":{"$error":"#N/A"}},{"$f":"VLOOKUP(A22,saisie!B$5:W$44,6,0)","v":{"$error":"#N/A"}},{"$error":"#N/A"},{"$f":"VLOOKUP(A22,saisie!B$5:W$44,8,0)","v":{"$error":"#N/A"}},{"$f":"VLOOKUP(A22,saisie!B$5:W$44,9,0)","v":{"$error":"#N/A"}},{"$f":"VLOOKUP(A22,saisie!B$5:W$44,10,0)","v":{"$error":"#N/A"}},{"$f":"VLOOKUP(A22,saisie!B$5:W$44,11,0)","v":{"$error":"#N/A"}},{"$error":"#N/A"},{"$f":"VLOOKUP(A22,saisie!B$5:W$44,13,0)","v":{"$error":"#N/A"}},{"$f":"VLOOKUP(A22,saisie!B$5:W$44,14,0)","v":{"$error":"#N/A"}},{"$f":"VLOOKUP(A22,saisie!B$5:W$44,15,0)","v":{"$error":"#N/A"}},{"$f":"VLOOKUP(A22,saisie!B$5:W$44,16,0)","v":{"$error":"#N/A"}},{"$error":"#N/A"},{"$f":"VLOOKUP(A22,saisie!B$5:W$44,18,0)","v":{"$error":"#N/A"}},{"$error":"#N/A"},{"$f":"VLOOKUP(A22,saisie!B$5:W$44,20,0)","v":{"$error":"#N/A"}}]
[{"$f":"IF(INFO!B8>18,19,\"\")","v":""},{"$f":"VLOOKUP(A23,saisie!B$5:W$44,2,0)","v":{"$error":"#N/A"}},{"$f":"VLOOKUP(A23,saisie!B$5:W$44,3,0)","v":{"$error":"#N/A"}},{"$f":"VLOOKUP(A23,saisie!B$5:W$44,4,0)","v":{"$error":"#N/A"}},{"$f":"VLOOKUP(A23,saisie!B$5:W$44,5,0)","v":{"$error":"#N/A"}},{"$f":"VLOOKUP(A23,saisie!B$5:W$44,6,0)","v":{"$error":"#N/A"}},{"$error":"#N/A"},{"$f":"VLOOKUP(A23,saisie!B$5:W$44,8,0)","v":{"$error":"#N/A"}},{"$f":"VLOOKUP(A23,saisie!B$5:W$44,9,0)","v":{"$error":"#N/A"}},{"$f":"VLOOKUP(A23,saisie!B$5:W$44,10,0)","v":{"$error":"#N/A"}},{"$f":"VLOOKUP(A23,saisie!B$5:W$44,11,0)","v":{"$error":"#N/A"}},{"$error":"#N/A"},{"$f":"VLOOKUP(A23,saisie!B$5:W$44,13,0)","v":{"$error":"#N/A"}},{"$f":"VLOOKUP(A23,saisie!B$5:W$44,14,0)","v":{"$error":"#N/A"}},{"$f":"VLOOKUP(A23,saisie!B$5:W$44,15,0)","v":{"$error":"#N/A"}},{"$f":"VLOOKUP(A23,saisie!B$5:W$44,16,0)","v":{"$error":"#N/A"}},{"$error":"#N/A"},{"$f":"VLOOKUP(A23,saisie!B$5:W$44,18,0)","v":{"$error":"#N/A"}},{"$error":"#N/A"},{"$f":"VLOOKUP(A23,saisie!B$5:W$44,20,0)","v":{"$error":"#N/A"}}]
[{"$f":"IF(INFO!B8>19,20,\"\")","v":""},{"$f":"VLOOKUP(A24,saisie!B$5:W$44,2,0)","v":{"$error":"#N/A"}},{"$f":"VLOOKUP(A24,saisie!B$5:W$44,3,0)","v":{"$error":"#N/A"}},{"$f":"VLOOKUP(A24,saisie!B$5:W$44,4,0)","v":{"$error":"#N/A"}},{"$f":"VLOOKUP(A24,saisie!B$5:W$44,5,0)","v":{"$error":"#N/A"}},{"$f":"VLOOKUP(A24,saisie!B$5:W$44,6,0)","v":{"$error":"#N/A"}},{"$error":"#N/A"},{"$f":"VLOOKUP(A24,saisie!B$5:W$44,8,0)","v":{"$error":"#N/A"}},{"$f":"VLOOKUP(A24,saisie!B$5:W$44,9,0)","v":{"$error":"#N/A"}},{"$f":"VLOOKUP(A24,saisie!B$5:W$44,10,0)","v":{"$error":"#N/A"}},{"$f":"VLOOKUP(A24,saisie!B$5:W$44,11,0)","v":{"$error":"#N/A"}},{"$error":"#N/A"},{"$f":"VLOOKUP(A24,saisie!B$5:W$44,13,0)","v":{"$error":"#N/A"}},{"$f":"VLOOKUP(A24,saisie!B$5:W$44,14,0)","v":{"$error":"#N/A"}},{"$f":"VLOOKUP(A24,saisie!B$5:W$44,15,0)","v":{"$error":"#N/A"}},{"$f":"VLOOKUP(A24,saisie!B$5:W$44,16,0)","v":{"$error":"#N/A"}},{"$error":"#N/A"},{"$f":"VLOOKUP(A24,saisie!B$5:W$44,18,0)","v":{"$error":"#N/A"}},{"$error":"#N/A"},{"$f":"VLOOKUP(A24,saisie!B$5:W$44,20,0)","v":{"$error":"#N/A"}}]
[{"$f":"IF(INFO!B8>20,21,\"\")","v":""},{"$f":"VLOOKUP(A25,saisie!B$5:W$44,2,0)","v":{"$error":"#N/A"}},{"$f":"VLOOKUP(A25,saisie!B$5:W$44,3,0)","v":{"$error":"#N/A"}},{"$f":"VLOOKUP(A25,saisie!B$5:W$44,4,0)","v":{"$error":"#N/A"}},{"$f":"VLOOKUP(A25,saisie!B$5:W$44,5,0)","v":{"$error":"#N/A"}},{"$f":"VLOOKUP(A25,saisie!B$5:W$44,6,0)","v":{"$error":"#N/A"}},{"$error":"#N/A"},{"$f":"VLOOKUP(A25,saisie!B$5:W$44,8,0)","v":{"$error":"#N/A"}},{"$f":"VLOOKUP(A25,saisie!B$5:W$44,9,0)","v":{"$error":"#N/A"}},{"$f":"VLOOKUP(A25,saisie!B$5:W$44,10,0)","v":{"$error":"#N/A"}},{"$f":"VLOOKUP(A25,saisie!B$5:W$44,11,0)","v":{"$error":"#N/A"}},{"$error":"#N/A"},{"$f":"VLOOKUP(A25,saisie!B$5:W$44,13,0)","v":{"$error":"#N/A"}},{"$f":"VLOOKUP(A25,saisie!B$5:W$44,14,0)","v":{"$error":"#N/A"}},{"$f":"VLOOKUP(A25,saisie!B$5:W$44,15,0)","v":{"$error":"#N/A"}},{"$f":"VLOOKUP(A25,saisie!B$5:W$44,16,0)","v":{"$error":"#N/A"}},{"$error":"#N/A"},{"$f":"VLOOKUP(A25,saisie!B$5:W$44,18,0)","v":{"$error":"#N/A"}},{"$error":"#N/A"},{"$f":"VLOOKUP(A25,saisie!B$5:W$44,20,0)","v":{"$error":"#N/A"}}]
[{"$f":"IF(INFO!B8>21,22,\"\")","v":""},{"$f":"VLOOKUP(A26,saisie!B$5:W$44,2,0)","v":{"$error":"#N/A"}},{"$f":"VLOOKUP(A26,saisie!B$5:W$44,3,0)","v":{"$error":"#N/A"}},{"$f":"VLOOKUP(A26,saisie!B$5:W$44,4,0)","v":{"$error":"#N/A"}},{"$f":"VLOOKUP(A26,saisie!B$5:W$44,5,0)","v":{"$error":"#N/A"}},{"$f":"VLOOKUP(A26,saisie!B$5:W$44,6,0)","v":{"$error":"#N/A"}},{"$error":"#N/A"},{"$f":"VLOOKUP(A26,saisie!B$5:W$44,8,0)","v":{"$error":"#N/A"}},{"$f":"VLOOKUP(A26,saisie!B$5:W$44,9,0)","v":{"$error":"#N/A"}},{"$f":"VLOOKUP(A26,saisie!B$5:W$44,10,0)","v":{"$error":"#N/A"}},{"$f":"VLOOKUP(A26,saisie!B$5:W$44,11,0)","v":{"$error":"#N/A"}},{"$error":"#N/A"},{"$f":"VLOOKUP(A26,saisie!B$5:W$44,13,0)","v":{"$error":"#N/A"}},{"$f":"VLOOKUP(A26,saisie!B$5:W$44,14,0)","v":{"$error":"#N/A"}},{"$f":"VLOOKUP(A26,saisie!B$5:W$44,15,0)","v":{"$error":"#N/A"}},{"$f":"VLOOKUP(A26,saisie!B$5:W$44,16,0)","v":{"$error":"#N/A"}},{"$error":"#N/A"},{"$f":"VLOOKUP(A26,saisie!B$5:W$44,18,0)","v":{"$error":"#N/A"}},{"$error":"#N/A"},{"$f":"VLOOKUP(A26,saisie!B$5:W$44,20,0)","v":{"$error":"#N/A"}}]
[{"$f":"IF(INFO!B8>22,23,\"\")","v":""},{"$f":"VLOOKUP(A27,saisie!B$5:W$44,2,0)","v":{"$error":"#N/A"}},{"$f":"VLOOKUP(A27,saisie!B$5:W$44,3,0)","v":{"$error":"#N/A"}},{"$f":"VLOOKUP(A27,saisie!B$5:W$44,4,0)","v":{"$error":"#N/A"}},{"$f":"VLOOKUP(A27,saisie!B$5:W$44,5,0)","v":{"$error":"#N/A"}},{"$f":"VLOOKUP(A27,saisie!B$5:W$44,6,0)","v":{"$error":"#N/A"}},{"$error":"#N/A"},{"$f":"VLOOKUP(A27,saisie!B$5:W$44,8,0)","v":{"$error":"#N/A"}},{"$f":"VLOOKUP(A27,saisie!B$5:W$44,9,0)","v":{"$error":"#N/A"}},{"$f":"VLOOKUP(A27,saisie!B$5:W$44,10,0)","v":{"$error":"#N/A"}},{"$f":"VLOOKUP(A27,saisie!B$5:W$44,11,0)","v":{"$error":"#N/A"}},{"$error":"#N/A"},{"$f":"VLOOKUP(A27,saisie!B$5:W$44,13,0)","v":{"$error":"#N/A"}},{"$f":"VLOOKUP(A27,saisie!B$5:W$44,14,0)","v":{"$error":"#N/A"}},{"$f":"VLOOKUP(A27,saisie!B$5:W$44,15,0)","v":{"$error":"#N/A"}},{"$f":"VLOOKUP(A27,saisie!B$5:W$44,16,0)","v":{"$error":"#N/A"}},{"$error":"#N/A"},{"$f":"VLOOKUP(A27,saisie!B$5:W$44,18,0)","v":{"$error":"#N/A"}},{"$error":"#N/A"},{"$f":"VLOOKUP(A27,saisie!B$5:W$44,20,0)","v":{"$error":"#N/A"}}]
[{"$f":"IF(INFO!B8>23,24,\"\")","v":""},{"$f":"VLOOKUP(A28,saisie!B$5:W$44,2,0)","v":{"$error":"#N/A"}},{"$f":"VLOOKUP(A28,saisie!B$5:W$44,3,0)","v":{"$error":"#N/A"}},{"$f":"VLOOKUP(A28,saisie!B$5:W$44,4,0)","v":{"$error":"#N/A"}},{"$f":"VLOOKUP(A28,saisie!B$5:W$44,5,0)","v":{"$error":"#N/A"}},{"$f":"VLOOKUP(A28,saisie!B$5:W$44,6,0)","v":{"$error":"#N/A"}},{"$error":"#N/A"},{"$f":"VLOOKUP(A28,saisie!B$5:W$44,8,0)","v":{"$error":"#N/A"}},{"$f":"VLOOKUP(A28,saisie!B$5:W$44,9,0)","v":{"$error":"#N/A"}},{"$f":"VLOOKUP(A28,saisie!B$5:W$44,10,0)","v":{"$error":"#N/A"}},{"$f":"VLOOKUP(A28,saisie!B$5:W$44,11,0)","v":{"$error":"#N/A"}},{"$error":"#N/A"},{"$f":"VLOOKUP(A28,saisie!B$5:W$44,13,0)","v":{"$error":"#N/A"}},{"$f":"VLOOKUP(A28,saisie!B$5:W$44,14,0)","v":{"$error":"#N/A"}},{"$f":"VLOOKUP(A28,saisie!B$5:W$44,15,0)","v":{"$error":"#N/A"}},{"$f":"VLOOKUP(A28,saisie!B$5:W$44,16,0)","v":{"$error":"#N/A"}},{"$error":"#N/A"},{"$f":"VLOOKUP(A28,saisie!B$5:W$44,18,0)","v":{"$error":"#N/A"}},{"$error":"#N/A"},{"$f":"VLOOKUP(A28,saisie!B$5:W$44,20,0)","v":{"$error":"#N/A"}}]
[{"$f":"IF(INFO!B8>24,25,\"\")","v":""},{"$f":"VLOOKUP(A29,saisie!B$5:W$44,2,0)","v":{"$error":"#N/A"}},{"$f":"VLOOKUP(A29,saisie!B$5:W$44,3,0)","v":{"$error":"#N/A"}},{"$f":"VLOOKUP(A29,saisie!B$5:W$44,4,0)","v":{"$error":"#N/A"}},{"$f":"VLOOKUP(A29,saisie!B$5:W$44,5,0)","v":{"$error":"#N/A"}},{"$f":"VLOOKUP(A29,saisie!B$5:W$44,6,0)","v":{"$error":"#N/A"}},{"$error":"#N/A"},{"$f":"VLOOKUP(A29,saisie!B$5:W$44,8,0)","v":{"$error":"#N/A"}},{"$f":"VLOOKUP(A29,saisie!B$5:W$44,9,0)","v":{"$error":"#N/A"}},{"$f":"VLOOKUP(A29,saisie!B$5:W$44,10,0)","v":{"$error":"#N/A"}},{"$f":"VLOOKUP(A29,saisie!B$5:W$44,11,0)","v":{"$error":"#N/A"}},{"$error":"#N/A"},{"$f":"VLOOKUP(A29,saisie!B$5:W$44,13,0)","v":{"$error":"#N/A"}},{"$f":"VLOOKUP(A29,saisie!B$5:W$44,14,0)","v":{"$error":"#N/A"}},{"$f":"VLOOKUP(A29,saisie!B$5:W$44,15,0)","v":{"$error":"#N/A"}},{"$f":"VLOOKUP(A29,saisie!B$5:W$44,16,0)","v":{"$error":"#N/A"}},{"$error":"#N/A"},{"$f":"VLOOKUP(A29,saisie!B$5:W$44,18,0)","v":{"$error":"#N/A"}},{"$error":"#N/A"},{"$f":"VLOOKUP(A29,saisie!B$5:W$44,20,0)","v":{"$error":"#N/A"}}]
[{"$f":"IF(INFO!B8>25,26,\"\")","v":""},{"$f":"VLOOKUP(A30,saisie!B$5:W$44,2,0)","v":{"$error":"#N/A"}},{"$f":"VLOOKUP(A30,saisie!B$5:W$44,3,0)","v":{"$error":"#N/A"}},{"$f":"VLOOKUP(A30,saisie!B$5:W$44,4,0)","v":{"$error":"#N/A"}},{"$f":"VLOOKUP(A30,saisie!B$5:W$44,5,0)","v":{"$error":"#N/A"}},{"$f":"VLOOKUP(A30,saisie!B$5:W$44,6,0)","v":{"$error":"#N/A"}},{"$error":"#N/A"},{"$f":"VLOOKUP(A30,saisie!B$5:W$44,8,0)","v":{"$error":"#N/A"}},{"$f":"VLOOKUP(A30,saisie!B$5:W$44,9,0)","v":{"$error":"#N/A"}},{"$f":"VLOOKUP(A30,saisie!B$5:W$44,10,0)","v":{"$error":"#N/A"}},{"$f":"VLOOKUP(A30,saisie!B$5:W$44,11,0)","v":{"$error":"#N/A"}},{"$error":"#N/A"},{"$f":"VLOOKUP(A30,saisie!B$5:W$44,13,0)","v":{"$error":"#N/A"}},{"$f":"VLOOKUP(A30,saisie!B$5:W$44,14,0)","v":{"$error":"#N/A"}},{"$f":"VLOOKUP(A30,saisie!B$5:W$44,15,0)","v":{"$error":"#N/A"}},{"$f":"VLOOKUP(A30,saisie!B$5:W$44,16,0)","v":{"$error":"#N/A"}},{"$error":"#N/A"},{"$f":"VLOOKUP(A30,saisie!B$5:W$44,18,0)","v":{"$error":"#N/A"}},{"$error":"#N/A"},{"$f":"VLOOKUP(A30,saisie!B$5:W$44,20,0)","v":{"$error":"#N/A"}}]
[{"$f":"IF(INFO!B8>26,27,\"\")","v":""},{"$f":"VLOOKUP(A31,saisie!B$5:W$44,2,0)","v":{"$error":"#N/A"}},{"$f":"VLOOKUP(A31,saisie!B$5:W$44,3,0)","v":{"$error":"#N/A"}},{"$f":"VLOOKUP(A31,saisie!B$5:W$44,4,0)","v":{"$error":"#N/A"}},{"$f":"VLOOKUP(A31,saisie!B$5:W$44,5,0)","v":{"$error":"#N/A"}},{"$f":"VLOOKUP(A31,saisie!B$5:W$44,6,0)","v":{"$error":"#N/A"}},{"$error":"#N/A"},{"$f":"VLOOKUP(A31,saisie!B$5:W$44,8,0)","v":{"$error":"#N/A"}},{"$f":"VLOOKUP(A31,saisie!B$5:W$44,9,0)","v":{"$error":"#N/A"}},{"$f":"VLOOKUP(A31,saisie!B$5:W$44,10,0)","v":{"$error":"#N/A"}},{"$f":"VLOOKUP(A31,saisie!B$5:W$44,11,0)","v":{"$error":"#N/A"}},{"$error":"#N/A"},{"$f":"VLOOKUP(A31,saisie!B$5:W$44,13,0)","v":{"$error":"#N/A"}},{"$f":"VLOOKUP(A31,saisie!B$5:W$44,14,0)","v":{"$error":"#N/A"}},{"$f":"VLOOKUP(A31,saisie!B$5:W$44,15,0)","v":{"$error":"#N/A"}},{"$f":"VLOOKUP(A31,saisie!B$5:W$44,16,0)","v":{"$error":"#N/A"}},{"$error":"#N/A"},{"$f":"VLOOKUP(A31,saisie!B$5:W$44,18,0)","v":{"$error":"#N/A"}},{"$error":"#N/A"},{"$f":"VLOOKUP(A31,saisie!B$5:W$44,20,0)","v":{"$error":"#N/A"}}]
[{"$f":"IF(INFO!B8>27,28,\"\")","v":""},{"$f":"VLOOKUP(A32,saisie!B$5:W$44,2,0)","v":{"$error":"#N/A"}},{"$f":"VLOOKUP(A32,saisie!B$5:W$44,3,0)","v":{"$error":"#N/A"}},{"$f":"VLOOKUP(A32,saisie!B$5:W$44,4,0)","v":{"$error":"#N/A"}},{"$f":"VLOOKUP(A32,saisie!B$5:W$44,5,0)","v":{"$error":"#N/A"}},{"$f":"VLOOKUP(A32,saisie!B$5:W$44,6,0)","v":{"$error":"#N/A"}},{"$error":"#N/A"},{"$f":"VLOOKUP(A32,saisie!B$5:W$44,8,0)","v":{"$error":"#N/A"}},{"$f":"VLOOKUP(A32,saisie!B$5:W$44,9,0)","v":{"$error":"#N/A"}},{"$f":"VLOOKUP(A32,saisie!B$5:W$44,10,0)","v":{"$error":"#N/A"}},{"$f":"VLOOKUP(A32,saisie!B$5:W$44,11,0)","v":{"$error":"#N/A"}},{"$error":"#N/A"},{"$f":"VLOOKUP(A32,saisie!B$5:W$44,13,0)","v":{"$error":"#N/A"}},{"$f":"VLOOKUP(A32,saisie!B$5:W$44,14,0)","v":{"$error":"#N/A"}},{"$f":"VLOOKUP(A32,saisie!B$5:W$44,15,0)","v":{"$error":"#N/A"}},{"$f":"VLOOKUP(A32,saisie!B$5:W$44,16,0)","v":{"$error":"#N/A"}},{"$error":"#N/A"},{"$f":"VLOOKUP(A32,saisie!B$5:W$44,18,0)","v":{"$error":"#N/A"}},{"$error":"#N/A"},{"$f":"VLOOKUP(A32,saisie!B$5:W$44,20,0)","v":{"$error":"#N/A"}}]
[{"$f":"IF(INFO!B8>28,29,\"\")","v":""},{"$f":"VLOOKUP(A33,saisie!B$5:W$44,2,0)","v":{"$error":"#N/A"}},{"$f":"VLOOKUP(A33,saisie!B$5:W$44,3,0)","v":{"$error":"#N/A"}},{"$f":"VLOOKUP(A33,saisie!B$5:W$44,4,0)","v":{"$error":"#N/A"}},{"$f":"VLOOKUP(A33,saisie!B$5:W$44,5,0)","v":{"$error":"#N/A"}},{"$f":"VLOOKUP(A33,saisie!B$5:W$44,6,0)","v":{"$error":"#N/A"}},{"$error":"#N/A"},{"$f":"VLOOKUP(A33,saisie!B$5:W$44,8,0)","v":{"$error":"#N/A"}},{"$f":"VLOOKUP(A33,saisie!B$5:W$44,9,0)","v":{"$error":"#N/A"}},{"$f":"VLOOKUP(A33,saisie!B$5:W$44,10,0)","v":{"$error":"#N/A"}},{"$f":"VLOOKUP(A33,saisie!B$5:W$44,11,0)","v":{"$error":"#N/A"}},{"$error":"#N/A"},{"$f":"VLOOKUP(A33,saisie!B$5:W$44,13,0)","v":{"$error":"#N/A"}},{"$f":"VLOOKUP(A33,saisie!B$5:W$44,14,0)","v":{"$error":"#N/A"}},{"$f":"VLOOKUP(A33,saisie!B$5:W$44,15,0)","v":{"$error":"#N/A"}},{"$f":"VLOOKUP(A33,saisie!B$5:W$44,16,0)","v":{"$error":"#N/A"}},{"$error":"#N/A"},{"$f":"VLOOKUP(A33,saisie!B$5:W$44,18,0)","v":{"$error":"#N/A"}},{"$error":"#N/A"},{"$f":"VLOOKUP(A33,saisie!B$5:W$44,20,0)","v":{"$error":"#N/A"}}]
[{"$f":"IF(INFO!B8>29,30,\"\")","v":""},{"$f":"VLOOKUP(A34,saisie!B$5:W$44,2,0)","v":{"$error":"#N/A"}},{"$f":"VLOOKUP(A34,saisie!B$5:W$44,3,0)","v":{"$error":"#N/A"}},{"$f":"VLOOKUP(A34,saisie!B$5:W$44,4,0)","v":{"$error":"#N/A"}},{"$f":"VLOOKUP(A34,saisie!B$5:W$44,5,0)","v":{"$error":"#N/A"}},{"$f":"VLOOKUP(A34,saisie!B$5:W$44,6,0)","v":{"$error":"#N/A"}},{"$error":"#N/A"},{"$f":"VLOOKUP(A34,saisie!B$5:W$44,8,0)","v":{"$error":"#N/A"}},{"$f":"VLOOKUP(A34,saisie!B$5:W$44,9,0)","v":{"$error":"#N/A"}},{"$f":"VLOOKUP(A34,saisie!B$5:W$44,10,0)","v":{"$error":"#N/A"}},{"$f":"VLOOKUP(A34,saisie!B$5:W$44,11,0)","v":{"$error":"#N/A"}},{"$error":"#N/A"},{"$f":"VLOOKUP(A34,saisie!B$5:W$44,13,0)","v":{"$error":"#N/A"}},{"$f":"VLOOKUP(A34,saisie!B$5:W$44,14,0)","v":{"$error":"#N/A"}},{"$f":"VLOOKUP(A34,saisie!B$5:W$44,15,0)","v":{"$error":"#N/A"}},{"$f":"VLOOKUP(A34,saisie!B$5:W$44,16,0)","v":{"$error":"#N/A"}},{"$error":"#N/A"},{"$f":"VLOOKUP(A34,saisie!B$5:W$44,18,0)","v":{"$error":"#N/A"}},{"$error":"#N/A"},{"$f":"VLOOKUP(A34,saisie!B$5:W$44,20,0)","v":{"$error":"#N/A"}}]
[{"$f":"IF(INFO!B8>30,31,\"\")","v":""},{"$f":"VLOOKUP(A35,saisie!B$5:W$44,2,0)","v":{"$error":"#N/A"}},{"$f":"VLOOKUP(A35,saisie!B$5:W$44,3,0)","v":{"$error":"#N/A"}},{"$f":"VLOOKUP(A35,saisie!B$5:W$44,4,0)","v":{"$error":"#N/A"}},{"$f":"VLOOKUP(A35,saisie!B$5:W$44,5,0)","v":{"$error":"#N/A"}},{"$f":"VLOOKUP(A35,saisie!B$5:W$44,6,0)","v":{"$error":"#N/A"}},{"$error":"#N/A"},{"$f":"VLOOKUP(A35,saisie!B$5:W$44,8,0)","v":{"$error":"#N/A"}},{"$f":"VLOOKUP(A35,saisie!B$5:W$44,9,0)","v":{"$error":"#N/A"}},{"$f":"VLOOKUP(A35,saisie!B$5:W$44,10,0)","v":{"$error":"#N/A"}},{"$f":"VLOOKUP(A35,saisie!B$5:W$44,11,0)","v":{"$error":"#N/A"}},{"$error":"#N/A"},{"$f":"VLOOKUP(A35,saisie!B$5:W$44,13,0)","v":{"$error":"#N/A"}},{"$f":"VLOOKUP(A35,saisie!B$5:W$44,14,0)","v":{"$error":"#N/A"}},{"$f":"VLOOKUP(A35,saisie!B$5:W$44,15,0)","v":{"$error":"#N/A"}},{"$f":"VLOOKUP(A35,saisie!B$5:W$44,16,0)","v":{"$error":"#N/A"}},{"$error":"#N/A"},{"$f":"VLOOKUP(A35,saisie!B$5:W$44,18,0)","v":{"$error":"#N/A"}},{"$error":"#N/A"},{"$f":"VLOOKUP(A35,saisie!B$5:W$44,20,0)","v":{"$error":"#N/A"}}]
[{"$f":"IF(INFO!B8>31,32,\"\")","v":""},{"$f":"VLOOKUP(A36,saisie!B$5:W$44,2,0)","v":{"$error":"#N/A"}},{"$f":"VLOOKUP(A36,saisie!B$5:W$44,3,0)","v":{"$error":"#N/A"}},{"$f":"VLOOKUP(A36,saisie!B$5:W$44,4,0)","v":{"$error":"#N/A"}},{"$f":"VLOOKUP(A36,saisie!B$5:W$44,5,0)","v":{"$error":"#N/A"}},{"$f":"VLOOKUP(A36,saisie!B$5:W$44,6,0)","v":{"$error":"#N/A"}},{"$error":"#N/A"},{"$f":"VLOOKUP(A36,saisie!B$5:W$44,8,0)","v":{"$error":"#N/A"}},{"$f":"VLOOKUP(A36,saisie!B$5:W$44,9,0)","v":{"$error":"#N/A"}},{"$f":"VLOOKUP(A36,saisie!B$5:W$44,10,0)","v":{"$error":"#N/A"}},{"$f":"VLOOKUP(A36,saisie!B$5:W$44,11,0)","v":{"$error":"#N/A"}},{"$error":"#N/A"},{"$f":"VLOOKUP(A36,saisie!B$5:W$44,13,0)","v":{"$error":"#N/A"}},{"$f":"VLOOKUP(A36,saisie!B$5:W$44,14,0)","v":{"$error":"#N/A"}},{"$f":"VLOOKUP(A36,saisie!B$5:W$44,15,0)","v":{"$error":"#N/A"}},{"$f":"VLOOKUP(A36,saisie!B$5:W$44,16,0)","v":{"$error":"#N/A"}},{"$error":"#N/A"},{"$f":"VLOOKUP(A36,saisie!B$5:W$44,18,0)","v":{"$error":"#N/A"}},{"$error":"#N/A"},{"$f":"VLOOKUP(A36,saisie!B$5:W$44,20,0)","v":{"$error":"#N/A"}}]
[{"$f":"IF(INFO!B8>32,33,\"\")","v":""},{"$f":"VLOOKUP(A37,saisie!B$5:W$44,2,0)","v":{"$error":"#N/A"}},{"$f":"VLOOKUP(A37,saisie!B$5:W$44,3,0)","v":{"$error":"#N/A"}},{"$f":"VLOOKUP(A37,saisie!B$5:W$44,4,0)","v":{"$error":"#N/A"}},{"$f":"VLOOKUP(A37,saisie!B$5:W$44,5,0)","v":{"$error":"#N/A"}},{"$f":"VLOOKUP(A37,saisie!B$5:W$44,6,0)","v":{"$error":"#N/A"}},{"$error":"#N/A"},{"$f":"VLOOKUP(A37,saisie!B$5:W$44,8,0)","v":{"$error":"#N/A"}},{"$f":"VLOOKUP(A37,saisie!B$5:W$44,9,0)","v":{"$error":"#N/A"}},{"$f":"VLOOKUP(A37,saisie!B$5:W$44,10,0)","v":{"$error":"#N/A"}},{"$f":"VLOOKUP(A37,saisie!B$5:W$44,11,0)","v":{"$error":"#N/A"}},{"$error":"#N/A"},{"$f":"VLOOKUP(A37,saisie!B$5:W$44,13,0)","v":{"$error":"#N/A"}},{"$f":"VLOOKUP(A37,saisie!B$5:W$44,14,0)","v":{"$error":"#N/A"}},{"$f":"VLOOKUP(A37,saisie!B$5:W$44,15,0)","v":{"$error":"#N/A"}},{"$f":"VLOOKUP(A37,saisie!B$5:W$44,16,0)","v":{"$error":"#N/A"}},{"$error":"#N/A"},{"$f":"VLOOKUP(A37,saisie!B$5:W$44,18,0)","v":{"$error":"#N/A"}},{"$error":"#N/A"},{"$f":"VLOOKUP(A37,saisie!B$5:W$44,20,0)","v":{"$error":"#N/A"}}]
[{"$f":"IF(INFO!B8>33,34,\"\")","v":""},{"$f":"VLOOKUP(A38,saisie!B$5:W$44,2,0)","v":{"$error":"#N/A"}},{"$f":"VLOOKUP(A38,saisie!B$5:W$44,3,0)","v":{"$error":"#N/A"}},{"$f":"VLOOKUP(A38,saisie!B$5:W$44,4,0)","v":{"$error":"#N/A"}},{"$f":"VLOOKUP(A38,saisie!B$5:W$44,5,0)","v":{"$error":"#N/A"}},{"$f":"VLOOKUP(A38,saisie!B$5:W$44,6,0)","v":{"$error":"#N/A"}},{"$error":"#N/A"},{"$f":"VLOOKUP(A38,saisie!B$5:W$44,8,0)","v":{"$error":"#N/A"}},{"$f":"VLOOKUP(A38,saisie!B$5:W$44,9,0)","v":{"$error":"#N/A"}},{"$f":"VLOOKUP(A38,saisie!B$5:W$44,10,0)","v":{"$error":"#N/A"}},{"$f":"VLOOKUP(A38,saisie!B$5:W$44,11,0)","v":{"$error":"#N/A"}},{"$error":"#N/A"},{"$f":"VLOOKUP(A38,saisie!B$5:W$44,13,0)","v":{"$error":"#N/A"}},{"$f":"VLOOKUP(A38,saisie!B$5:W$44,14,0)","v":{"$error":"#N/A"}},{"$f":"VLOOKUP(A38,saisie!B$5:W$44,15,0)","v":{"$error":"#N/A"}},{"$f":"VLOOKUP(A38,saisie!B$5:W$44,16,0)","v":{"$error":"#N/A"}},{"$error":"#N/A"},{"$f":"VLOOKUP(A38,saisie!B$5:W$44,18,0)","v":{"$error":"#N/A"}},{"$error":"#N/A"},{"$f":"VLOOKUP(A38,saisie!B$5:W$44,20,0)","v":{"$error":"#N/A"}}]
[{"$f":"IF(INFO!B8>34,35,\"\")","v":""},{"$f":"VLOOKUP(A39,saisie!B$5:W$44,2,0)","v":{"$error":"#N/A"}},{"$f":"VLOOKUP(A39,saisie!B$5:W$44,3,0)","v":{"$error":"#N/A"}},{"$f":"VLOOKUP(A39,saisie!B$5:W$44,4,0)","v":{"$error":"#N/A"}},{"$f":"VLOOKUP(A39,saisie!B$5:W$44,5,0)","v":{"$error":"#N/A"}},{"$f":"VLOOKUP(A39,saisie!B$5:W$44,6,0)","v":{"$error":"#N/A"}},{"$error":"#N/A"},{"$f":"VLOOKUP(A39,saisie!B$5:W$44,8,0)","v":{"$error":"#N/A"}},{"$f":"VLOOKUP(A39,saisie!B$5:W$44,9,0)","v":{"$error":"#N/A"}},{"$f":"VLOOKUP(A39,saisie!B$5:W$44,10,0)","v":{"$error":"#N/A"}},{"$f":"VLOOKUP(A39,saisie!B$5:W$44,11,0)","v":{"$error":"#N/A"}},{"$error":"#N/A"},{"$f":"VLOOKUP(A39,saisie!B$5:W$44,13,0)","v":{"$error":"#N/A"}},{"$f":"VLOOKUP(A39,saisie!B$5:W$44,14,0)","v":{"$error":"#N/A"}},{"$f":"VLOOKUP(A39,saisie!B$5:W$44,15,0)","v":{"$error":"#N/A"}},{"$f":"VLOOKUP(A39,saisie!B$5:W$44,16,0)","v":{"$error":"#N/A"}},{"$error":"#N/A"},{"$f":"VLOOKUP(A39,saisie!B$5:W$44,18,0)","v":{"$error":"#N/A"}},{"$error":"#N/A"},{"$f":"VLOOKUP(A39,saisie!B$5:W$44,20,0)","v":{"$error":"#N/A"}}]
[{"$f":"IF(INFO!B8>35,36,\"\")","v":""},{"$f":"VLOOKUP(A40,saisie!B$5:W$44,2,0)","v":{"$error":"#N/A"}},{"$f":"VLOOKUP(A40,saisie!B$5:W$44,3,0)","v":{"$error":"#N/A"}},{"$f":"VLOOKUP(A40,saisie!B$5:W$44,4,0)","v":{"$error":"#N/A"}},{"$f":"VLOOKUP(A40,saisie!B$5:W$44,5,0)","v":{"$error":"#N/A"}},{"$f":"VLOOKUP(A40,saisie!B$5:W$44,6,0)","v":{"$error":"#N/A"}},{"$error":"#N/A"},{"$f":"VLOOKUP(A40,saisie!B$5:W$44,8,0)","v":{"$error":"#N/A"}},{"$f":"VLOOKUP(A40,saisie!B$5:W$44,9,0)","v":{"$error":"#N/A"}},{"$f":"VLOOKUP(A40,saisie!B$5:W$44,10,0)","v":{"$error":"#N/A"}},{"$f":"VLOOKUP(A40,saisie!B$5:W$44,11,0)","v":{"$error":"#N/A"}},{"$error":"#N/A"},{"$f":"VLOOKUP(A40,saisie!B$5:W$44,13,0)","v":{"$error":"#N/A"}},{"$f":"VLOOKUP(A40,saisie!B$5:W$44,14,0)","v":{"$error":"#N/A"}},{"$f":"VLOOKUP(A40,saisie!B$5:W$44,15,0)","v":{"$error":"#N/A"}},{"$f":"VLOOKUP(A40,saisie!B$5:W$44,16,0)","v":{"$error":"#N/A"}},{"$error":"#N/A"},{"$f":"VLOOKUP(A40,saisie!B$5:W$44,18,0)","v":{"$error":"#N/A"}},{"$error":"#N/A"},{"$f":"VLOOKUP(A40,saisie!B$5:W$44,20,0)","v":{"$error":"#N/A"}}]
[{"$f":"IF(INFO!B8>36,37,\"\")","v":""},{"$f":"VLOOKUP(A41,saisie!B$5:W$44,2,0)","v":{"$error":"#N/A"}},{"$f":"VLOOKUP(A41,saisie!B$5:W$44,3,0)","v":{"$error":"#N/A"}},{"$f":"VLOOKUP(A41,saisie!B$5:W$44,4,0)","v":{"$error":"#N/A"}},{"$f":"VLOOKUP(A41,saisie!B$5:W$44,5,0)","v":{"$error":"#N/A"}},{"$f":"VLOOKUP(A41,saisie!B$5:W$44,6,0)","v":{"$error":"#N/A"}},{"$error":"#N/A"},{"$f":"VLOOKUP(A41,saisie!B$5:W$44,8,0)","v":{"$error":"#N/A"}},{"$f":"VLOOKUP(A41,saisie!B$5:W$44,9,0)","v":{"$error":"#N/A"}},{"$f":"VLOOKUP(A41,saisie!B$5:W$44,10,0)","v":{"$error":"#N/A"}},{"$f":"VLOOKUP(A41,saisie!B$5:W$44,11,0)","v":{"$error":"#N/A"}},{"$error":"#N/A"},{"$f":"VLOOKUP(A41,saisie!B$5:W$44,13,0)","v":{"$error":"#N/A"}},{"$f":"VLOOKUP(A41,saisie!B$5:W$44,14,0)","v":{"$error":"#N/A"}},{"$f":"VLOOKUP(A41,saisie!B$5:W$44,15,0)","v":{"$error":"#N/A"}},{"$f":"VLOOKUP(A41,saisie!B$5:W$44,16,0)","v":{"$error":"#N/A"}},{"$error":"#N/A"},{"$f":"VLOOKUP(A41,saisie!B$5:W$44,18,0)","v":{"$error":"#N/A"}},{"$error":"#N/A"},{"$f":"VLOOKUP(A41,saisie!B$5:W$44,20,0)","v":{"$error":"#N/A"}}]
[{"$f":"IF(INFO!B8>37,38,\"\")","v":""},{"$f":"VLOOKUP(A42,saisie!B$5:W$44,2,0)","v":{"$error":"#N/A"}},{"$f":"VLOOKUP(A42,saisie!B$5:W$44,3,0)","v":{"$error":"#N/A"}},{"$f":"VLOOKUP(A42,saisie!B$5:W$44,4,0)","v":{"$error":"#N/A"}},{"$f":"VLOOKUP(A42,saisie!B$5:W$44,5,0)","v":{"$error":"#N/A"}},{"$f":"VLOOKUP(A42,saisie!B$5:W$44,6,0)","v":{"$error":"#N/A"}},{"$error":"#N/A"},{"$f":"VLOOKUP(A42,saisie!B$5:W$44,8,0)","v":{"$error":"#N/A"}},{"$f":"VLOOKUP(A42,saisie!B$5:W$44,9,0)","v":{"$error":"#N/A"}},{"$f":"VLOOKUP(A42,saisie!B$5:W$44,10,0)","v":{"$error":"#N/A"}},{"$f":"VLOOKUP(A42,saisie!B$5:W$44,11,0)","v":{"$error":"#N/A"}},{"$error":"#N/A"},{"$f":"VLOOKUP(A42,saisie!B$5:W$44,13,0)","v":{"$error":"#N/A"}},{"$f":"VLOOKUP(A42,saisie!B$5:W$44,14,0)","v":{"$error":"#N/A"}},{"$f":"VLOOKUP(A42,saisie!B$5:W$44,15,0)","v":{"$error":"#N/A"}},{"$f":"VLOOKUP(A42,saisie!B$5:W$44,16,0)","v":{"$error":"#N/A"}},{"$error":"#N/A"},{"$f":"VLOOKUP(A42,saisie!B$5:W$44,18,0)","v":{"$error":"#N/A"}},{"$error":"#N/A"},{"$f":"VLOOKUP(A42,saisie!B$5:W$44,20,0)","v":{"$error":"#N/A"}}]
[{"$f":"IF(INFO!B8>38,39,\"\")","v":""},{"$f":"VLOOKUP(A43,saisie!B$5:W$44,2,0)","v":{"$error":"#N/A"}},{"$f":"VLOOKUP(A43,saisie!B$5:W$44,3,0)","v":{"$error":"#N/A"}},{"$f":"VLOOKUP(A43,saisie!B$5:W$44,4,0)","v":{"$error":"#N/A"}},{"$f":"VLOOKUP(A43,saisie!B$5:W$44,5,0)","v":{"$error":"#N/A"}},{"$f":"VLOOKUP(A43,saisie!B$5:W$44,6,0)","v":{"$error":"#N/A"}},{"$error":"#N/A"},{"$f":"VLOOKUP(A43,saisie!B$5:W$44,8,0)","v":{"$error":"#N/A"}},{"$f":"VLOOKUP(A43,saisie!B$5:W$44,9,0)","v":{"$error":"#N/A"}},{"$f":"VLOOKUP(A43,saisie!B$5:W$44,10,0)","v":{"$error":"#N/A"}},{"$f":"VLOOKUP(A43,saisie!B$5:W$44,11,0)","v":{"$error":"#N/A"}},{"$error":"#N/A"},{"$f":"VLOOKUP(A43,saisie!B$5:W$44,13,0)","v":{"$error":"#N/A"}},{"$f":"VLOOKUP(A43,saisie!B$5:W$44,14,0)","v":{"$error":"#N/A"}},{"$f":"VLOOKUP(A43,saisie!B$5:W$44,15,0)","v":{"$error":"#N/A"}},{"$f":"VLOOKUP(A43,saisie!B$5:W$44,16,0)","v":{"$error":"#N/A"}},{"$error":"#N/A"},{"$f":"VLOOKUP(A43,saisie!B$5:W$44,18,0)","v":{"$error":"#N/A"}},{"$error":"#N/A"},{"$f":"VLOOKUP(A43,saisie!B$5:W$44,20,0)","v":{"$error":"#N/A"}}]
[{"$f":"IF(INFO!B8>39,40,\"\")","v":""},{"$f":"VLOOKUP(A44,saisie!B$5:W$44,2,0)","v":{"$error":"#N/A"}},{"$f":"VLOOKUP(A44,saisie!B$5:W$44,3,0)","v":{"$error":"#N/A"}},{"$f":"VLOOKUP(A44,saisie!B$5:W$44,4,0)","v":{"$error":"#N/A"}},{"$f":"VLOOKUP(A44,saisie!B$5:W$44,5,0)","v":{"$error":"#N/A"}},{"$f":"VLOOKUP(A44,saisie!B$5:W$44,6,0)","v":{"$error":"#N/A"}},{"$error":"#N/A"},{"$f":"VLOOKUP(A44,saisie!B$5:W$44,8,0)","v":{"$error":"#N/A"}},{"$f":"VLOOKUP(A44,saisie!B$5:W$44,9,0)","v":{"$error":"#N/A"}},{"$f":"VLOOKUP(A44,saisie!B$5:W$44,10,0)","v":{"$error":"#N/A"}},{"$f":"VLOOKUP(A44,saisie!B$5:W$44,11,0)","v":{"$error":"#N/A"}},{"$error":"#N/A"},{"$f":"VLOOKUP(A44,saisie!B$5:W$44,13,0)","v":{"$error":"#N/A"}},{"$f":"VLOOKUP(A44,saisie!B$5:W$44,14,0)","v":{"$error":"#N/A"}},{"$f":"VLOOKUP(A44,saisie!B$5:W$44,15,0)","v":{"$error":"#N/A"}},{"$f":"VLOOKUP(A44,saisie!B$5:W$44,16,0)","v":{"$error":"#N/A"}},{"$error":"#N/A"},{"$f":"VLOOKUP(A44,saisie!B$5:W$44,18,0)","v":{"$error":"#N/A"}},{"$error":"#N/A"},{"$f":"VLOOKUP(A44,saisie!B$5:W$44,20,0)","v":{"$error":"#N/A"}}]

{"sheet":"Clb Q","index":3,"n_rows":26,"n_cols":20,"rows_kept":26,"cut":false,"hidden":false,"merged":[[3,7,3,8],[3,17,3,18],[21,7,21,8],[21,17,21,18],[15,7,15,8],[15,17,15,18],[0,1,0,19],[1,1,1,19],[21,2,21,3],[15,2,15,3],[9,2,9,3],[3,2,3,3],[3,12,3,13],[9,12,9,13],[15,12,15,13],[21,12,21,13],[9,7,9,8],[9,17,9,18]]}
[null,{"$f":"CONCATENATE(INFO!B7,\"    \",INFO!B9)","v":"CARABINE    POITOU-CHARENTES"}]
[null,"CLUBS QUALIFIES EN PHASE FINALE"]
[]
[null,"1er Match Qualif.",{"$f":"'M Q'!B5","v":"ROYAN   Les Mouettes"},null,{"$f":"'M Q'!S5","v":441.19999999999993},null,{"$f":"IF(INFO!B8>7,\"8e MQ\",\"\")","v":""},{"$f":"IF(INFO!B8>7,'M Q'!B12,\"\")","v":""},null,{"$f":"IF(INFO!B8>7,'M Q'!S12,\"\")","v":""},null,"9e MQ",{"$f":"IF(INFO!B8>8,'M Q'!B13,\"\")","v":""},null,{"$f":"IF(INFO!B8>8,'M Q'!S13,\"\")","v":""},null,"16e MQ",{"$f":"IF(INFO!B8>15,'M Q'!B20,\"\")","v":""},null,{"$f":"IF(INFO!B8>15,'M Q'!S20,\"\")","v":""}]
[null,"NOMS","série 1","série 2","POINTS",null,"NOMS","série 1","série 2","POINTS",null,"NOMS","série 1","série 2","POINTS",null,"NOMS","série 1","série 2","POINTS"]
[null,{"$f":"'M Q'!D5","v":"CHAUVET Tiago"},{"$f":"'M Q'!E5","v":84.2},{"$f":"'M Q'!F5","v":82},{"$f":"SUM(C6:D6)","v":166.2},null,{"$f":"IF(INFO!B8>7,'M Q'!D12,\"\")","v":""},{"$f":"IF(INFO!B8>7,'M Q'!E12,\"\")","v":""},{"$f":"IF(INFO!B8>7,'M Q'!F12,\"\")","v":""},{"$f":"IF(INFO!B8>7,SUM(H6:I6),\"\")","v":""},null,{"$f":"IF(INFO!B8>8,'M Q'!D13,\"\")","v":""},{"$f":"IF(INFO!B8>8,'M Q'!E13,\"\")","v":""},{"$f":"IF(INFO!B8>8,'M Q'!F13,\"\")","v":""},{"$f":"IF(INFO!B8>8,SUM(M6:N6),\"\")","v":""},null,{"$f":"IF(INFO!B8>15,'M Q'!D20,\"\")","v":""},{"$f":"IF(INFO!B8>15,'M Q'!E20,\"\")","v":""},{"$f":"IF(INFO!B8>15,'M Q'!F20,\"\")","v":""},{"$f":"IF(INFO!B8>15,SUM(R6:S6),\"\")","v":""}]
[null,{"$f":"'M Q'!I5","v":"CHOTARD Hugo"},{"$f":"'M Q'!J5","v":75.5},{"$f":"'M Q'!K5","v":64.599999999999994},{"$f":"SUM(C7:D7)","v":140.1},null,{"$f":"IF(INFO!B8>7,'M Q'!I12,\"\")","v":""},{"$f":"IF(INFO!B8>7,'M Q'!J12,\"\")","v":""},{"$f":"IF(INFO!B8>7,'M Q'!K12,\"\")","v":""},{"$f":"IF(INFO!B8>7,SUM(H7:I7),\"\")","v":""},null,{"$f":"IF(INFO!B8>8,'M Q'!I13,\"\")","v":""},{"$f":"IF(INFO!B8>8,'M Q'!J13,\"\")","v":""},{"$f":"IF(INFO!B8>8,'M Q'!K13,\"\")","v":""},{"$f":"IF(INFO!B8>8,SUM(M7:N7),\"\")","v":""},null,{"$f":"IF(INFO!B8>15,'M Q'!I20,\"\")","v":""},{"$f":"IF(INFO!B8>15,'M Q'!J20,\"\")","v":""},{"$f":"IF(INFO!B8>15,'M Q'!K20,\"\")","v":""},{"$f":"IF(INFO!B8>15,SUM(R7:S7),\"\")","v":""}]
[null,{"$f":"'M Q'!N5","v":"LEYRAT Quentin"},{"$f":"'M Q'!O5","v":63.6},{"$f":"'M Q'!P5","v":71.3},{"$f":"SUM(C8:D8)","v":134.9},null,{"$f":"IF(INFO!B8>7,'M Q'!N12,\"\")","v":""},{"$f":"IF(INFO!B8>7,'M Q'!O12,\"\")","v":""},{"$f":"IF(INFO!B8>7,'M Q'!P12,\"\")","v":""},{"$f":"IF(INFO!B8>7,SUM(H8:I8),\"\")","v":""},null,{"$f":"IF(INFO!B8>8,'M Q'!N13,\"\")","v":""},{"$f":"IF(INFO!B8>8,'M Q'!O13,\"\")","v":""},{"$f":"IF(INFO!B8>8,'M Q'!P13,\"\")","v":""},{"$f":"IF(INFO!B8>8,SUM(M8:N8),\"\")","v":""},null,{"$f":"IF(INFO!B8>15,'M Q'!N20,\"\")","v":""},{"$f":"IF(INFO!B8>15,'M Q'!O20,\"\")","v":""},{"$f":"IF(INFO!B8>15,'M Q'!P20,\"\")","v":""},{"$f":"IF(INFO!B8>15,SUM(R8:S8),\"\")","v":""}]
[]
[null,"2e MQ",{"$f":"'M Q'!B6","v":"JONZAC   S.J.T"},null,{"$f":"'M Q'!S6","v":423.7},null,{"$f":"IF(INFO!B8>6,\"7e MQ\",\"\")","v":""},{"$f":"IF(INFO!B8>6,'M Q'!B11,\"\")","v":""},null,{"$f":"IF(INFO!B8>6,'M Q'!S11,\"\")","v":""},null,"10e MQ",{"$f":"IF(INFO!B8>9,'M Q'!B14,\"\")","v":""},null,{"$f":"IF(INFO!B8>9,'M Q'!S14,\"\")","v":""},null,"15e MQ",{"$f":"IF(INFO!B8>14,'M Q'!B19,\"\")","v":""},null,{"$f":"IF(INFO!B8>14,'M Q'!S19,\"\")","v":""}]
[null,"NOMS","série 1","série 2","POINTS",null,"NOMS","série 1","série 2","POINTS",null,"NOMS","série 1","série 2","POINTS",null,"NOMS","série 1","série 2","POINTS"]
[null,{"$f":"'M Q'!D6","v":"CRUCHET Luna"},{"$f":"'M Q'!E6","v":58.8},{"$f":"'M Q'!F6","v":58.7},{"$f":"SUM(C12:D12)","v":117.5},null,{"$f":"IF(INFO!B8>6,'M Q'!D11,\"\")","v":""},{"$f":"IF(INFO!B8>6,'M Q'!E11,\"\")","v":""},{"$f":"IF(INFO!B8>6,'M Q'!F11,\"\")","v":""},{"$f":"IF(INFO!B8>6,SUM(H12:I12),\"\")","v":""},null,{"$f":"IF(INFO!B8>9,'M Q'!D14,\"\")","v":""},{"$f":"IF(INFO!B8>9,'M Q'!E14,\"\")","v":""},{"$f":"IF(INFO!B8>9,'M Q'!F14,\"\")","v":""},{"$f":"IF(INFO!B8>9,SUM(M12:N12),\"\")","v":""},null,{"$f":"IF(INFO!B8>14,'M Q'!D19,\"\")","v":""},{"$f":"IF(INFO!B8>14,'M Q'!E19,\"\")","v":""},{"$f":"IF(INFO!B8>14,'M Q'!F19,\"\")","v":""},{"$f":"IF(INFO!B8>14,SUM(R12:S12),\"\")","v":""}]
[null,{"$f":"'M Q'!I6","v":"MIGNOT Axel"},{"$f":"'M Q'!J6","v":94.9},{"$f":"'M Q'!K6","v":86.6},{"$f":"SUM(C13:D13)","v":181.5},null,{"$f":"IF(INFO!B8>6,'M Q'!I11,\"\")","v":""},{"$f":"IF(INFO!B8>6,'M Q'!J11,\"\")","v":""},{"$f":"IF(INFO!B8>6,'M Q'!K11,\"\")","v":""},{"$f":"IF(INFO!B8>6,SUM(H13:I13),\"\")","v":""},null,{"$f":"IF(INFO!B8>9,'M Q'!I14,\"\")","v":""},{"$f":"IF(INFO!B8>9,'M Q'!J14,\"\")","v":""},{"$f":"IF(INFO!B8>9,'M Q'!K14,\"\")","v":""},{"$f":"IF(INFO!B8>9,SUM(M13:N13),\"\")","v":""},null,{"$f":"IF(INFO!B8>14,'M Q'!I19,\"\")","v":""},{"$f":"IF(INFO!B8>14,'M Q'!J19,\"\")","v":""},{"$f":"IF(INFO!B8>14,'M Q'!K19,\"\")","v":""},{"$f":"IF(INFO!B8>14,SUM(R13:S13),\"\")","v":""}]
[null,{"$f":"'M Q'!N6","v":"MILLEMONT Colline"},{"$f":"'M Q'!O6","v":57.4},{"$f":"'M Q'!P6","v":67.3},{"$f":"SUM(C14:D14)","v":124.69999999999999},null,{"$f":"IF(INFO!B8>6,'M Q'!N11,\"\")","v":""},{"$f":"IF(INFO!B8>6,'M Q'!O11,\"\")","v":""},{"$f":"IF(INFO!B8>6,'M Q'!P11,\"\")","v":""},{"$f":"IF(INFO!B8>6,SUM(H14:I14),\"\")","v":""},null,{"$f":"IF(INFO!B8>9,'M Q'!N14,\"\")","v":""},{"$f":"IF(INFO!B8>9,'M Q'!O14,\"\")","v":""},{"$f":"IF(INFO!B8>9,'M Q'!P14,\"\")","v":""},{"$f":"IF(INFO!B8>9,SUM(M14:N14),\"\")","v":""},null,{"$f":"IF(INFO!B8>14,'M Q'!N19,\"\")","v":""},{"$f":"IF(INFO!B8>14,'M Q'!O19,\"\")","v":""},{"$f":"IF(INFO!B8>14,'M Q'!P19,\"\")","v":""},{"$f":"IF(INFO!B8>14,SUM(R14:S14),\"\")","v":""}]
[]
[null,{"$f":"IF(INFO!B8>2,\"3e MQ\",\"\")","v":""},{"$f":"IF(INFO!B8>2,'M Q'!B7,\"\")","v":""},null,{"$f":"IF(INFO!B8>2,'M Q'!S7,\"\")","v":""},null,{"$f":"IF(INFO!B8>5,\"6e MQ\",\"\")","v":""},{"$f":"IF(INFO!B8>5,'M Q'!B10,\"\")","v":""},null,{"$f":"IF(INFO!B8>5,'M Q'!S10,\"\")","v":""},null,"11e MQ",{"$f":"IF(INFO!B8>10,'M Q'!B15,\"\")","v":""},null,{"$f":"IF(INFO!B8>10,'M Q'!S15,\"\")","v":""},null,"14e MQ",{"$f":"IF(INFO!B8>13,'M Q'!B18,\"\")","v":""},null,{"$f":"IF(INFO!B8>13,'M Q'!S18,\"\")","v":""}]
[null,"NOMS","série 1","série 2","POINTS",null,"NOMS","série 1","série 2","POINTS",null,"NOMS","série 1","série 2","POINTS",null,"NOMS","série 1","série 2","POINTS"]
[null,{"$f":"IF(INFO!B8>2,'M Q'!D7,\"\")","v":""},{"$f":"IF(INFO!B8>2,'M Q'!E7,\"\")","v":""},{"$f":"IF(INFO!B8>2,'M Q'!F7,\"\")","v":""},{"$f":"IF(INFO!B8>2,SUM(C18:D18),\"\")","v":""},null,{"$f":"IF(INFO!B8>5,'M Q'!D10,\"\")","v":""},{"$f":"IF(INFO!B8>5,'M Q'!E10,\"\")","v":""},{"$f":"IF(INFO!B8>5,'M Q'!F10,\"\")","v":""},{"$f":"IF(INFO!B8>5,SUM(H18:I18),\"\")","v":""},null,{"$f":"IF(INFO!B8>10,'M Q'!D15,\"\")","v":""},{"$f":"IF(INFO!B8>10,'M Q'!E15,\"\")","v":""},{"$f":"IF(INFO!B8>10,'M Q'!F15,\"\")","v":""},{"$f":"IF(INFO!B8>10,SUM(M18:N18),\"\")","v":""},null,{"$f":"IF(INFO!B8>13,'M Q'!D18,\"\")","v":""},{"$f":"IF(INFO!B8>13,'M Q'!E18,\"\")","v":""},{"$f":"IF(INFO!B8>13,'M Q'!F18,\"\")","v":""},{"$f":"IF(INFO!B8>13,SUM(R18:S18),\"\")","v":""}]
[null,{"$f":"IF(INFO!B8>2,'M Q'!I7,\"\")","v":""},{"$f":"IF(INFO!B8>2,'M Q'!J7,\"\")","v":""},{"$f":"IF(INFO!B8>2,'M Q'!K7,\"\")","v":""},{"$f":"IF(INFO!B8>2,SUM(C19:D19),\"\")","v":""},null,{"$f":"IF(INFO!B8>5,'M Q'!I10,\"\")","v":""},{"$f":"IF(INFO!B8>5,'M Q'!J10,\"\")","v":""},{"$f":"IF(INFO!B8>5,'M Q'!K10,\"\")","v":""},{"$f":"IF(INFO!B8>5,SUM(H19:I19),\"\")","v":""},null,{"$f":"IF(INFO!B8>10,'M Q'!I15,\"\")","v":""},{"$f":"IF(INFO!B8>10,'M Q'!J15,\"\")","v":""},{"$f":"IF(INFO!B8>10,'M Q'!K15,\"\")","v":""},{"$f":"IF(INFO!B8>10,SUM(M19:N19),\"\")","v":""},null,{"$f":"IF(INFO!B8>13,'M Q'!I18,\"\")","v":""},{"$f":"IF(INFO!B8>13,'M Q'!J18,\"\")","v":""},{"$f":"IF(INFO!B8>13,'M Q'!K18,\"\")","v":""},{"$f":"IF(INFO!B8>13,SUM(R19:S19),\"\")","v":""}]
[null,{"$f":"IF(INFO!B8>2,'M Q'!N7,\"\")","v":""},{"$f":"IF(INFO!B8>2,'M Q'!O7,\"\")","v":""},{"$f":"IF(INFO!B8>2,'M Q'!P7,\"\")","v":""},{"$f":"IF(INFO!B8>2,SUM(C20:D20),\"\")","v":""},null,{"$f":"IF(INFO!B8>5,'M Q'!N10,\"\")","v":""},{"$f":"IF(INFO!B8>5,'M Q'!O10,\"\")","v":""},{"$f":"IF(INFO!B8>5,'M Q'!P10,\"\")","v":""},{"$f":"IF(INFO!B8>5,SUM(H20:I20),\"\")","v":""},null,{"$f":"IF(INFO!B8>10,'M Q'!N15,\"\")","v":""},{"$f":"IF(INFO!B8>10,'M Q'!O15,\"\")","v":""},{"$f":"IF(INFO!B8>10,'M Q'!P15,\"\")","v":""},{"$f":"IF(INFO!B8>10,SUM(M20:N20),\"\")","v":""},null,{"$f":"IF(INFO!B8>13,'M Q'!N18,\"\")","v":""},{"$f":"IF(INFO!B8>13,'M Q'!O18,\"\")","v":""},{"$f":"IF(INFO!B8>13,'M Q'!P18,\"\")","v":""},{"$f":"IF(INFO!B8>13,SUM(R20:S20),\"\")","v":""}]
[]
[null,{"$f":"IF(INFO!B8>3,\"4e MQ\",\"\")","v":""},{"$f":"IF(INFO!B8>3,'M Q'!B8,\"\")","v":""},null,{"$f":"IF(INFO!B8>3,'M Q'!S8,\"\")","v":""},null,{"$f":"IF(INFO!B8>4,\"5e MQ\",\"\")","v":""},{"$f":"IF(INFO!B8>4,'M Q'!B9,\"\")","v":""},null,{"$f":"IF(INFO!B8>4,'M Q'!S9,\"\")","v":""},null,"12e MQ",{"$f":"IF(INFO!B8>11,'M Q'!B16,\"\")","v":""},null,{"$f":"IF(INFO!B8>11,'M Q'!S16,\"\")","v":""},null,"13e MQ",{"$f":"IF(INFO!B8>12,'M Q'!B17,\"\")","v":""},null,{"$f":"IF(INFO!B8>12,'M Q'!S17,\"\")","v":""}]
[null,"NOMS","série 1","série 2","POINTS",null,"NOMS","série 1","série 2","POINTS",null,"NOMS","série 1","série 2","POINTS",null,"NOMS","série 1","série 2","POINTS"]
[null,{"$f":"IF(INFO!B8>3,'M Q'!D8,\"\")","v":""},{"$f":"IF(INFO!B8>3,'M Q'!E8,\"\")","v":""},{"$f":"IF(INFO!B8>3,'M Q'!F8,\"\")","v":""},{"$f":"IF(INFO!B8>3,SUM(C24:D24),\"\")","v":""},null,{"$f":"IF(INFO!B8>4,'M Q'!D9,\"\")","v":""},{"$f":"IF(INFO!B8>4,'M Q'!E9,\"\")","v":""},{"$f":"IF(INFO!B8>4,'M Q'!F9,\"\")","v":""},{"$f":"IF(INFO!B8>4,SUM(H24:I24),\"\")","v":""},null,{"$f":"IF(INFO!B8>11,'M Q'!D16,\"\")","v":""},{"$f":"IF(INFO!B8>11,'M Q'!E16,\"\")","v":""},{"$f":"IF(INFO!B8>11,'M Q'!F16,\"\")","v":""},{"$f":"IF(INFO!B8>11,SUM(M24:N24),\"\")","v":""},null,{"$f":"IF(INFO!B8>12,'M Q'!D17,\"\")","v":""},{"$f":"IF(INFO!B8>12,'M Q'!E17,\"\")","v":""},{"$f":"IF(INFO!B8>12,'M Q'!F17,\"\")","v":""},{"$f":"IF(INFO!B8>12,SUM(R24:S24),\"\")","v":""}]
[null,{"$f":"IF(INFO!B8>3,'M Q'!I8,\"\")","v":""},{"$f":"IF(INFO!B8>3,'M Q'!J8,\"\")","v":""},{"$f":"IF(INFO!B8>3,'M Q'!K8,\"\")","v":""},{"$f":"IF(INFO!B8>3,SUM(C25:D25),\"\")","v":""},null,{"$f":"IF(INFO!B8>4,'M Q'!I9,\"\")","v":""},{"$f":"IF(INFO!B8>4,'M Q'!J9,\"\")","v":""},{"$f":"IF(INFO!B8>4,'M Q'!K9,\"\")","v":""},{"$f":"IF(INFO!B8>4,SUM(H25:I25),\"\")","v":""},null,{"$f":"IF(INFO!B8>11,'M Q'!I16,\"\")","v":""},{"$f":"IF(INFO!B8>11,'M Q'!J16,\"\")","v":""},{"$f":"IF(INFO!B8>11,'M Q'!K16,\"\")","v":""},{"$f":"IF(INFO!B8>11,SUM(M25:N25),\"\")","v":""},null,{"$f":"IF(INFO!B8>12,'M Q'!I17,\"\")","v":""},{"$f":"IF(INFO!B8>12,'M Q'!J17,\"\")","v":""},{"$f":"IF(INFO!B8>12,'M Q'!K17,\"\")","v":""},{"$f":"IF(INFO!B8>12,SUM(R25:S25),\"\")","v":""}]
[null,{"$f":"IF(INFO!B8>3,'M Q'!N8,\"\")","v":""},{"$f":"IF(INFO!B8>3,'M Q'!O8,\"\")","v":""},{"$f":"IF(INFO!B8>3,'M Q'!P8,\"\")","v":""},{"$f":"IF(INFO!B8>3,SUM(C26:D26),\"\")","v":""},null,{"$f":"IF(INFO!B8>4,'M Q'!N9,\"\")","v":""},{"$f":"IF(INFO!B8>4,'M Q'!O9,\"\")","v":""},{"$f":"IF(INFO!B8>4,'M Q'!P9,\"\")","v":""},{"$f":"IF(INFO!B8>4,SUM(H26:I26),\"\")","v":""},null,{"$f":"IF(INFO!B8>11,'M Q'!N16,\"\")","v":""},{"$f":"IF(INFO!B8>11,'M Q'!O16,\"\")","v":""},{"$f":"IF(INFO!B8>11,'M Q'!P16,\"\")","v":""},{"$f":"IF(INFO!B8>11,SUM(M26:N26),\"\")","v":""},null,{"$f":"IF(INFO!B8>12,'M Q'!N17,\"\")","v":""},{"$f":"IF(INFO!B8>12,'M Q'!O17,\"\")","v":""},{"$f":"IF(INFO!B8>12,'M Q'!P17,\"\")","v":""},{"$f":"IF(INFO!B8>12,SUM(R26:S26),\"\")","v":""}]

{"sheet":"P.F.","index":4,"n_rows":104,"n_cols":20,"rows_kept":104,"cut":false,"hidden":false,"merged":[[74,14,74,15],[75,14,75,15],[76,14,76,15],[93,9,93,10],[97,9,97,10],[98,9,98,10],[99,9,99,10],[100,9,100,10],[79,9,79,10],[78,6,78,13],[87,9,87,10],[88,9,88,10],[80,6,80,8],[80,11,80,13],[79,6,79,8],[95,11,95,13],[93,11,93,13],[81,6,81,8],[81,11,81,13],[82,6,82,8],[94,6,94,8],[63,14,63,15],[70,4,70,5],[71,4,71,5],[72,4,72,5],[70,14,70,15],[71,14,71,15],[72,14,72,15],[63,4,63,5],[66,14,66,15],[66,6,66,8],[66,11,66,13],[60,14,60,15],[61,14,61,15],[62,14,62,15],[43,14,43,15],[55,11,55,13],[55,14,55,15],[53,14,53,15],[58,11,58,13],[45,14,45,15],[46,11,46,13],[59,14,59,15],[58,16,58,18],[47,16,47,18],[48,16,48,18],[47,6,47,8],[38,16,38,18],[46,16,46,18],[45,16,45,18],[45,6,45,8],[45,11,45,13],[56,16,56,18],[56,11,56,13],[50,14,50,15],[51,14,51,15],[52,14,52,15],[49,17,53,18],[44,0,44,19],[38,1,38,3],[40,14,40,15],[38,11,38,13],[55,16,55,18],[49,14,49,15],[47,11,47,13],[39,17,43,18],[46,6,46,8],[3,4,3,5],[31,4,31,5],[32,4,32,5],[35,1,35,3],[35,6,35,8],[29,4,29,5],[30,4,30,5],[47,1,47,3],[39,4,39,5],[46,1,46,3],[28,4,28,5],[45,1,45,3],[45,4,45,5],[23,0,23,19],[25,16,25,18],[24,16,24,18],[39,7,43,8],[41,4,41,5],[42,4,42,5],[37,6,37,8],[28,11,32,12],[37,11,37,13],[11,14,11,15],[17,14,17,15],[36,16,36,18],[31,14,31,15],[32,14,32,15],[26,6,26,8],[26,11,26,13],[26,16,26,18],[24,14,24,15],[21,14,21,15],[19,14,19,15],[20,14,20,15],[17,7,21,8],[17,11,21,12],[17,17,21,18],[37,16,37,18],[27,16,27,18],[28,1,32,2],[39,1,43,2],[28,7,32,8],[27,1,27,3],[27,6,27,8],[27,11,27,13],[26,1,26,3],[41,14,41,15],[38,6,38,8],[42,14,42,15],[43,4,43,5],[40,4,40,5],[39,14,39,15],[39,11,43,12],[36,6,36,8],[36,11,36,13],[28,17,32,18],[35,16,35,18],[35,14,35,15],[28,14,28,15],[29,14,29,15],[30,14,30,15],[17,4,17,5],[24,6,24,8],[13,14,13,15],[13,4,13,5],[20,4,20,5],[21,4,21,5],[14,16,14,18],[15,6,15,8],[15,11,15,13],[15,16,15,18],[16,6,16,8],[16,11,16,13],[18,4,18,5],[19,4,19,5],[18,14,18,15],[58,1,58,3],[58,6,58,8],[13,6,13,8],[53,4,53,5],[7,14,7,15],[8,14,8,15],[9,14,9,15],[10,14,10,15],[13,1,13,3],[55,1,55,3],[15,1,15,3],[9,4,9,5],[10,4,10,5],[11,4,11,5],[7,1,11,2],[7,4,7,5],[7,7,11,8],[8,4,8,5],[49,4,49,5],[48,6,48,8],[14,1,14,3],[14,6,14,8],[14,11,14,13],[24,11,24,13],[4,1,4,3],[57,6,57,8],[48,11,48,13],[49,1,53,2],[49,7,53,8],[48,1,48,3],[57,11,57,13],[56,1,56,3],[56,6,56,8],[4,6,4,8],[6,1,6,3],[6,6,6,8],[5,1,5,3],[5,6,5,8],[5,11,5,13],[25,1,25,3],[25,6,25,8],[24,4,24,5],[57,1,57,3],[55,6,55,8],[50,4,50,5],[51,4,51,5],[52,4,52,5],[55,4,55,5],[74,4,74,5],[70,11,76,12],[75,4,75,5],[69,6,69,8],[69,11,69,13],[59,1,63,2],[59,11,63,12],[59,7,63,8],[62,4,62,5],[59,4,59,5],[60,4,60,5],[61,4,61,5],[70,7,76,8],[3,16,3,18],[79,11,79,13],[70,17,76,18],[3,1,3,3],[3,6,3,8],[2,0,2,19],[3,14,3,15],[67,1,67,3],[67,6,67,8],[67,11,67,13],[68,1,68,3],[68,6,68,8],[68,11,68,13],[68,16,68,18],[25,11,25,13],[17,1,21,2],[16,1,16,3],[35,4,35,5],[37,1,37,3],[24,1,24,3],[36,1,36,3],[76,4,76,5],[69,1,69,3],[73,4,73,5],[3,11,3,13],[94,11,94,13],[93,6,93,8],[89,9,89,10],[83,6,89,7],[97,6,103,7],[97,12,103,13],[83,9,83,10],[84,9,84,10],[85,9,85,10],[86,9,86,10],[91,6,91,13],[96,6,96,8],[96,11,96,13],[95,6,95,8],[101,9,101,10],[102,9,102,10],[103,9,103,10],[35,11,35,13],[0,0,1,19],[73,14,73,15],[83,12,89,13],[82,11,82,13],[57,16,57,18],[49,11,53,12],[5,16,5,18],[4,11,4,13],[4,16,4,18],[6,16,6,18],[7,17,11,18],[16,16,16,18],[13,16,13,18],[6,11,6,13],[13,11,13,13],[7,11,11,12],[67,16,67,18],[66,16,66,18],[59,17,63,18],[65,0,65,19],[66,1,66,3],[66,4,66,5],[69,16,69,18],[70,1,76,2]]}
[{"$f":"INFO!B7","v":"CARABINE"}]
[]
["1/8 FINALES"]
[null,{"$f":"'Clb Q'!C4","v":"ROYAN   Les Mouettes"},null,null,"POSTE",null,{"$f":"'Clb Q'!R4","v":""},null,null,null,null,{"$f":"'Clb Q'!H22","v":""},null,null,"POSTE",null,{"$f":"'Clb Q'!M22","v":""}]
[null,{"$f":"'Clb Q'!B6","v":"CHAUVET Tiago"},null,null,3,4,{"$f":"'Clb Q'!Q6","v":""},null,null,null,null,{"$f":"'Clb Q'!G24","v":""},null,null,13,14,{"$f":"'Clb Q'!L24","v":""}]
[null,{"$f":"'Clb Q'!B7","v":"CHOTARD Hugo"},null,null,5,6,{"$f":"'Clb Q'!Q7","v":""},null,null,null,null,{"$f":"'Clb Q'!G25","v":""},null,null,15,16,{"$f":"'Clb Q'!L25","v":""}]
[null,{"$f":"'Clb Q'!B8","v":"LEYRAT Quentin"},null,null,7,8,{"$f":"'Clb Q'!Q8","v":""},null,null,null,null,{"$f":"'Clb Q'!G26","v":""},null,null,17,18,{"$f":"'Clb Q'!L26","v":""}]
[{"$f":"IF(D8=\"\",\"\",IF(D8>1,1,0))","v":""},{"$f":"IF(D8=\"\",\"\",SUM(A8:A12))","v":""},null,null,null,null,null,{"$f":"IF(G8=\"\",\"\",SUM(J8:J12))","v":""},null,{"$f":"IF(G8=\"\",\"\",IF(G8>1,1,0))","v":""},{"$f":"IF(N8=\"\",\"\",IF(N8>1,1,0))","v":""},{"$f":"IF(N8=\"\",\"\",SUM(K8:K12))","v":""},null,null,null,null,null,{"$f":"IF(Q8=\"\",\"\",SUM(T8:T12))","v":""},null,{"$f":"IF(Q8=\"\",\"\",IF(Q8>1,1,0))","v":""}]
[{"$f":"IF(D9=\"\",\"\",IF(D9>1,1,0))","v":""},null,null,null,null,null,null,null,null,{"$f":"IF(G9=\"\",\"\",IF(G9>1,1,0))","v":""},{"$f":"IF(N9=\"\",\"\",IF(N9>1,1,0))","v":""},null,null,null,null,null,null,null,null,{"$f":"IF(Q9=\"\",\"\",IF(Q9>1,1,0))","v":""}]
[{"$f":"IF(D10=\"\",\"\",IF(D10>1,1,0))","v":""},null,null,null,null,null,null,null,null,{"$f":"IF(G10=\"\",\"\",IF(G10>1,1,0))","v":""},{"$f":"IF(N10=\"\",\"\",IF(N10>1,1,0))","v":""},null,null,null,null,null,null,null,null,{"$f":"IF(Q10=\"\",\"\",IF(Q10>1,1,0))","v":""}]
[{"$f":"IF(D11=\"\",\"\",IF(D11>1,1,0))","v":""},null,null,null,null,null,null,null,null,{"$f":"IF(G11=\"\",\"\",IF(G11>1,1,0))","v":""},{"$f":"IF(N11=\"\",\"\",IF(N11>1,1,0))","v":""},null,null,null,null,null,null,null,null,{"$f":"IF(Q11=\"\",\"\",IF(Q11>1,1,0))","v":""}]
[{"$f":"IF(D12=\"\",\"\",IF(D12>1,1,0))","v":""},null,null,null,null,null,null,null,null,{"$f":"IF(G12=\"\",\"\",IF(G12>1,1,0))","v":""},{"$f":"IF(N12=\"\",\"\",IF(N12>1,1,0))","v":""},null,null,null,null,null,null,null,null,{"$f":"IF(Q12=\"\",\"\",IF(Q12>1,1,0))","v":""}]
[]
[null,{"$f":"'Clb Q'!M4","v":""},null,null,"POSTE",null,{"$f":"'Clb Q'!H4","v":""},null,null,null,null,{"$f":"'Clb Q'!R22","v":""},null,null,"POSTE",null,{"$f":"'Clb Q'!C22","v":""}]
[null,{"$f":"'Clb Q'!L6","v":""},null,null,3,4,{"$f":"'Clb Q'!G6","v":""},null,null,null,null,{"$f":"'Clb Q'!Q24","v":""},null,null,13,14,{"$f":"'Clb Q'!B24","v":""}]
[null,{"$f":"'Clb Q'!L7","v":""},null,null,5,6,{"$f":"'Clb Q'!G7","v":""},null,null,null,null,{"$f":"'Clb Q'!Q25","v":""},null,null,15,16,{"$f":"'Clb Q'!B25","v":""}]
[null,{"$f":"'Clb Q'!L8","v":""},null,null,7,8,{"$f":"'Clb Q'!G8","v":""},null,null,null,null,{"$f":"'Clb Q'!Q26","v":""},null,null,17,18,{"$f":"'Clb Q'!B26","v":""}]
[{"$f":"IF(D18=\"\",\"\",IF(D18>1,1,0))","v":""},{"$f":"IF(D18=\"\",\"\",SUM(A18:A22))","v":""},null,null,null,null,null,{"$f":"IF(G18=\"\",\"\",SUM(J18:J22))","v":""},null,{"$f":"IF(G18=\"\",\"\",IF(G18>1,1,0))","v":""},{"$f":"IF(N18=\"\",\"\",IF(N18>1,1,0))","v":""},{"$f":"IF(N18=\"\",\"\",SUM(K18:K22))","v":""},null,null,null,null,null,{"$f":"IF(Q18=\"\",\"\",SUM(T18:T22))","v":""},null,{"$f":"IF(Q18=\"\",\"\",IF(Q18>1,1,0))","v":""}]
[{"$f":"IF(D19=\"\",\"\",IF(D19>1,1,0))","v":""},null,null,null,null,null,null,null,null,{"$f":"IF(G19=\"\",\"\",IF(G19>1,1,0))","v":""},{"$f":"IF(N19=\"\",\"\",IF(N19>1,1,0))","v":""},null,null,null,null,null,null,null,null,{"$f":"IF(Q19=\"\",\"\",IF(Q19>1,1,0))","v":""}]
[{"$f":"IF(D20=\"\",\"\",IF(D20>1,1,0))","v":""},null,null,null,null,null,null,null,null,{"$f":"IF(G20=\"\",\"\",IF(G20>1,1,0))","v":""},{"$f":"IF(N20=\"\",\"\",IF(N20>1,1,0))","v":""},null,null,null,null,null,null,null,null,{"$f":"IF(Q20=\"\",\"\",IF(Q20>1,1,0))","v":""}]
[{"$f":"IF(D21=\"\",\"\",IF(D21>1,1,0))","v":""},null,null,null,null,null,null,null,null,{"$f":"IF(G21=\"\",\"\",IF(G21>1,1,0))","v":""},{"$f":"IF(N21=\"\",\"\",IF(N21>1,1,0))","v":""},null,null,null,null,null,null,null,null,{"$f":"IF(Q21=\"\",\"\",IF(Q21>1,1,0))","v":""}]
[{"$f":"IF(D22=\"\",\"\",IF(D22>1,1,0))","v":""},null,null,null,null,null,null,null,null,{"$f":"IF(G22=\"\",\"\",IF(G22>1,1,0))","v":""},{"$f":"IF(N22=\"\",\"\",IF(N22>1,1,0))","v":""},null,null,null,null,null,null,null,null,{"$f":"IF(Q22=\"\",\"\",IF(Q22>1,1,0))","v":""}]
[]
["1/8 FINALES (Suite)"]
[null,{"$f":"'Clb Q'!C16","v":""},null,null,"POSTE",null,{"$f":"'Clb Q'!R16","v":""},null,null,null,null,{"$f":"'Clb Q'!H10","v":""},null,null,"POSTE",null,{"$f":"'Clb Q'!M10","v":""}]
[null,{"$f":"'Clb Q'!B18","v":""},null,null,3,4,{"$f":"'Clb Q'!Q18","v":""},null,null,null,null,{"$f":"'Clb Q'!G12","v":""},null,null,13,14,{"$f":"'Clb Q'!L12","v":""}]
[null,{"$f":"'Clb Q'!B19","v":""},null,null,5,6,{"$f":"'Clb Q'!Q19","v":""},null,null,null,null,{"$f":"'Clb Q'!G13","v":""},null,null,15,16,{"$f":"'Clb Q'!L13","v":""}]
[null,{"$f":"'Clb Q'!B20","v":""},null,null,7,8,{"$f":"'Clb Q'!Q20","v":""},null,null,null,null,{"$f":"'Clb Q'!G14","v":""},null,null,17,18,{"$f":"'Clb Q'!L14","v":""}]
[{"$f":"IF(D29=\"\",\"\",IF(D29>1,1,0))","v":""},{"$f":"IF(D29=\"\",\"\",SUM(A29:A33))","v":""},null,null,null,null,null,{"$f":"IF(G29=\"\",\"\",SUM(J29:J33))","v":""},null,{"$f":"IF(G29=\"\",\"\",IF(G29>1,1,0))","v":""},{"$f":"IF(N29=\"\",\"\",IF(N29>1,1,0))","v":""},{"$f":"IF(N29=\"\",\"\",SUM(K29:K33))","v":""},null,null,null,null,null,{"$f":"IF(Q29=\"\",\"\",SUM(T29:T33))","v":""},null,{"$f":"IF(Q29=\"\",\"\",IF(Q29>1,1,0))","v":""}]
[{"$f":"IF(D30=\"\",\"\",IF(D30>1,1,0))","v":""},null,null,null,null,null,null,null,null,{"$f":"IF(G30=\"\",\"\",IF(G30>1,1,0))","v":""},{"$f":"IF(N30=\"\",\"\",IF(N30>1,1,0))","v":""},null,null,null,null,null,null,null,null,{"$f":"IF(Q30=\"\",\"\",IF(Q30>1,1,0))","v":""}]
[{"$f":"IF(D31=\"\",\"\",IF(D31>1,1,0))","v":""},null,null,null,null,null,null,null,null,{"$f":"IF(G31=\"\",\"\",IF(G31>1,1,0))","v":""},{"$f":"IF(N31=\"\",\"\",IF(N31>1,1,0))","v":""},null,null,null,null,null,null,null,null,{"$f":"IF(Q31=\"\",\"\",IF(Q31>1,1,0))","v":""}]
[{"$f":"IF(D32=\"\",\"\",IF(D32>1,1,0))","v":""},null,null,null,null,null,null,null,null,{"$f":"IF(G32=\"\",\"\",IF(G32>1,1,0))","v":""},{"$f":"IF(N32=\"\",\"\",IF(N32>1,1,0))","v":""},null,null,null,null,null,null,null,null,{"$f":"IF(Q32=\"\",\"\",IF(Q32>1,1,0))","v":""}]
[{"$f":"IF(D33=\"\",\"\",IF(D33>1,1,0))","v":""},null,null,null,null,null,null,null,null,{"$f":"IF(G33=\"\",\"\",IF(G33>1,1,0))","v":""},{"$f":"IF(N33=\"\",\"\",IF(N33>1,1,0))","v":""},null,null,null,null,null,null,null,null,{"$f":"IF(Q33=\"\",\"\",IF(Q33>1,1,0))","v":""}]
[]
[]
[null,{"$f":"'Clb Q'!M16","v":""},null,null,"POSTE",null,{"$f":"'Clb Q'!H16","v":""},null,null,null,null,{"$f":"'Clb Q'!R10","v":""},null,null,"POSTE",null,{"$f":"'Clb Q'!C10","v":"JONZAC   S.J.T"}]
[null,{"$f":"'Clb Q'!L18","v":""},null,null,3,4,{"$f":"'Clb Q'!G18","v":""},null,null,null,null,{"$f":"'Clb Q'!Q12","v":""},null,null,13,14,{"$f":"'Clb Q'!B12","v":"CRUCHET Luna"}]
[null,{"$f":"'Clb Q'!L19","v":""},null,null,5,6,{"$f":"'Clb Q'!G19","v":""},null,null,null,null,{"$f":"'Clb Q'!Q13","v":""},null,null,15,16,{"$f":"'Clb Q'!B13","v":"MIGNOT Axel"}]
[null,{"$f":"'Clb Q'!L20","v":""},null,null,7,8,{"$f":"'Clb Q'!G20","v":""},null,null,null,null,{"$f":"'Clb Q'!Q14","v":""},null,null,17,18,{"$f":"'Clb Q'!B14","v":"MILLEMONT Colline"}]
[{"$f":"IF(D40=\"\",\"\",IF(D40>1,1,0))","v":""},{"$f":"IF(D40=\"\",\"\",SUM(A40:A44))","v":""},null,null,null,null,null,{"$f":"IF(G40=\"\",\"\",SUM(J40:J44))","v":""},null,{"$f":"IF(G40=\"\",\"\",IF(G40>1,1,0))","v":""},{"$f":"IF(N40=\"\",\"\",IF(N40>1,1,0))","v":""},{"$f":"IF(N40=\"\",\"\",SUM(K40:K44))","v":""},null,null,null,null,null,{"$f":"IF(Q40=\"\",\"\",SUM(T40:T44))","v":""},null,{"$f":"IF(Q40=\"\",\"\",IF(Q40>1,1,0))","v":""}]
[{"$f":"IF(D41=\"\",\"\",IF(D41>1,1,0))","v":""},null,null,null,null,null,null,null,null,{"$f":"IF(G41=\"\",\"\",IF(G41>1,1,0))","v":""},{"$f":"IF(N41=\"\",\"\",IF(N41>1,1,0))","v":""},null,null,null,null,null,null,null,null,{"$f":"IF(Q41=\"\",\"\",IF(Q41>1,1,0))","v":""}]
[{"$f":"IF(D42=\"\",\"\",IF(D42>1,1,0))","v":""},null,null,null,null,null,null,null,null,{"$f":"IF(G42=\"\",\"\",IF(G42>1,1,0))","v":""},{"$f":"IF(N42=\"\",\"\",IF(N42>1,1,0))","v":""},null,null,null,null,null,null,null,null,{"$f":"IF(Q42=\"\",\"\",IF(Q42>1,1,0))","v":""}]
[{"$f":"IF(D43=\"\",\"\",IF(D43>1,1,0))","v":""},null,null,null,null,null,null,null,null,{"$f":"IF(G43=\"\",\"\",IF(G43>1,1,0))","v":""},{"$f":"IF(N43=\"\",\"\",IF(N43>1,1,0))","v":""},null,null,null,null,null,null,null,null,{"$f":"IF(Q43=\"\",\"\",IF(Q43>1,1,0))","v":""}]
[{"$f":"IF(D44=\"\",\"\",IF(D44>1,1,0))","v":""},null,null,null,null,null,null,null,null,{"$f":"IF(G44=\"\",\"\",IF(G44>1,1,0))","v":""},{"$f":"IF(N44=\"\",\"\",IF(N44>1,1,0))","v":""},null,null,null,null,null,null,null,null,{"$f":"IF(Q44=\"\",\"\",IF(Q44>1,1,0))","v":""}]
["1/4 FINALES"]
[null,{"$f":"IF(G4=\"\",B4,IF(B8=\"\",\"\",IF(B8>2,B4,IF(H8>2,G4,\"\"))))","v":"ROYAN   Les Mouettes"},null,null,"POSTE",null,{"$f":"IF(B14=\"\",G14,IF(B18=\"\",\"\",IF(B18>2,B14,IF(H18>2,G14,\"\"))))","v":""},null,null,null,null,{"$f":"IF(G25=\"\",B25,IF(B29=\"\",\"\",IF(B29>2,B25,IF(H29>2,G25,\"\"))))","v":""},null,null,"POSTE",null,{"$f":"IF(B36=\"\",G36,IF(B40=\"\",\"\",IF(B40>2,B36,IF(H40>2,G36,\"\"))))","v":""}]
[null,{"$f":"IF(G4=\"\",B5,IF(B8=\"\",\"\",IF(B8>2,B5,IF(H8>2,G5,\"\"))))","v":"CHAUVET Tiago"},null,null,3,4,{"$f":"IF(B14=\"\",G15,IF(B18=\"\",\"\",IF(B18>2,B15,IF(H18>2,G15,\"\"))))","v":""},null,null,null,null,{"$f":"IF(G25=\"\",B26,IF(B29=\"\",\"\",IF(B29>2,B26,IF(H29>2,G26,\"\"))))","v":""},null,null,3,4,{"$f":"IF(B36=\"\",G37,IF(B40=\"\",\"\",IF(B40>2,B37,IF(H40>2,G37,\"\"))))","v":""}]
[null,{"$f":"IF(G4=\"\",B6,IF(B8=\"\",\"\",IF(B8>2,B6,IF(H8>2,G6,\"\"))))","v":"CHOTARD Hugo"},null,null,5,6,{"$f":"IF(B14=\"\",G16,IF(B18=\"\",\"\",IF(B18>2,B16,IF(H18>2,G16,\"\"))))","v":""},null,null,null,null,{"$f":"IF(G25=\"\",B27,IF(B29=\"\",\"\",IF(B29>2,B27,IF(H29>2,G27,\"\"))))","v":""},null,null,5,6,{"$f":"IF(B36=\"\",G38,IF(B40=\"\",\"\",IF(B40>2,B38,IF(H40>2,G38,\"\"))))","v":""}]
[null,{"$f":"IF(G4=\"\",B7,IF(B8=\"\",\"\",IF(B8>2,B7,IF(H8>2,G7,\"\"))))","v":"LEYRAT Quentin"},null,null,7,8,{"$f":"IF(B14=\"\",G17,IF(B18=\"\",\"\",IF(B18>2,B17,IF(H18>2,G17,\"\"))))","v":""},null,null,null,null,{"$f":"IF(G25=\"\",B28,IF(B29=\"\",\"\",IF(B29>2,B28,IF(H29>2,G28,\"\"))))","v":""},null,null,7,8,{"$f":"IF(B36=\"\",G39,IF(B40=\"\",\"\",IF(B40>2,B39,IF(H40>2,G39,\"\"))))","v":""}]
[{"$f":"IF(D50=\"\",\"\",IF(D50>1,1,0))","v":""},{"$f":"IF(D50=\"\",\"\",SUM(A50:A54))","v":""},null,null,null,null,null,{"$f":"IF(G50=\"\",\"\",SUM(J50:J54))","v":""},null,{"$f":"IF(G50=\"\",\"\",IF(G50>1,1,0))","v":""},{"$f":"IF(N50=\"\",\"\",IF(N50>1,1,0))","v":""},{"$f":"IF(N50=\"\",\"\",SUM(K50:K54))","v":""},null,null,null,null,null,{"$f":"IF(Q50=\"\",\"\",SUM(T50:T54))","v":""},null,{"$f":"IF(Q50=\"\",\"\",IF(Q50>1,1,0))","v":""}]
[{"$f":"IF(D51=\"\",\"\",IF(D51>1,1,0))","v":""},null,null,null,null,null,null,null,null,{"$f":"IF(G51=\"\",\"\",IF(G51>1,1,0))","v":""},{"$f":"IF(N51=\"\",\"\",IF(N51>1,1,0))","v":""},null,null,null,null,null,null,null,null,{"$f":"IF(Q51=\"\",\"\",IF(Q51>1,1,0))","v":""}]
[{"$f":"IF(D52=\"\",\"\",IF(D52>1,1,0))","v":""},null,null,null,null,null,null,null,null,{"$f":"IF(G52=\"\",\"\",IF(G52>1,1,0))","v":""},{"$f":"IF(N52=\"\",\"\",IF(N52>1,1,0))","v":""},null,null,null,null,null,null,null,null,{"$f":"IF(Q52=\"\",\"\",IF(Q52>1,1,0))","v":""}]
[{"$f":"IF(D53=\"\",\"\",IF(D53>1,1,0))","v":""},null,null,null,null,null,null,null,null,{"$f":"IF(G53=\"\",\"\",IF(G53>1,1,0))","v":""},{"$f":"IF(N53=\"\",\"\",IF(N53>1,1,0))","v":""},null,null,null,null,null,null,null,null,{"$f":"IF(Q53=\"\",\"\",IF(Q53>1,1,0))","v":""}]
[{"$f":"IF(D54=\"\",\"\",IF(D54>1,1,0))","v":""},null,null,null,null,null,null,null,null,{"$f":"IF(G54=\"\",\"\",IF(G54>1,1,0))","v":""},{"$f":"IF(N54=\"\",\"\",IF(N54>1,1,0))","v":""},null,null,null,null,null,null,null,null,{"$f":"IF(Q54=\"\",\"\",IF(Q54>1,1,0))","v":""}]
[]
[null,{"$f":"IF(Q4=\"\",L4,IF(L8=\"\",\"\",IF(L8>2,L4,IF(R8>2,Q4,\"\"))))","v":""},null,null,"POSTE",null,{"$f":"IF(L14=\"\",Q14,IF(L18=\"\",\"\",IF(L18>2,L14,IF(R18>2,Q14,\"\"))))","v":""},null,null,null,null,{"$f":"IF(Q25=\"\",L25,IF(L29=\"\",\"\",IF(L29>2,L25,IF(R29>2,Q25,\"\"))))","v":""},null,null,"POSTE",null,{"$f":"IF(L36=\"\",Q36,IF(L40=\"\",\"\",IF(L40>2,L36,IF(R40>2,Q36,\"\"))))","v":"JONZAC   S.J.T"}]
[null,{"$f":"IF(Q4=\"\",L5,IF(L8=\"\",\"\",IF(L8>2,L5,IF(R8>2,Q5,\"\"))))","v":""},null,null,13,14,{"$f":"IF(L14=\"\",Q15,IF(L18=\"\",\"\",IF(L18>2,L15,IF(R18>2,Q15,\"\"))))","v":""},null,null,null,null,{"$f":"IF(Q25=\"\",L26,IF(L29=\"\",\"\",IF(L29>2,L26,IF(R29>2,Q26,\"\"))))","v":""},null,null,13,14,{"$f":"IF(L36=\"\",Q37,IF(L40=\"\",\"\",IF(L40>2,L37,IF(R40>2,Q37,\"\"))))","v":"CRUCHET Luna"}]
[null,{"$f":"IF(Q4=\"\",L6,IF(L8=\"\",\"\",IF(L8>2,L6,IF(R8>2,Q6,\"\"))))","v":""},null,null,15,16,{"$f":"IF(L14=\"\",Q16,IF(L18=\"\",\"\",IF(L18>2,L16,IF(R18>2,Q16,\"\"))))","v":""},null,null,null,null,{"$f":"IF(Q25=\"\",L27,IF(L29=\"\",\"\",IF(L29>2,L27,IF(R29>2,Q27,\"\"))))","v":""},null,null,15,16,{"$f":"IF(L36=\"\",Q38,IF(L40=\"\",\"\",IF(L40>2,L38,IF(R40>2,Q38,\"\"))))","v":"MIGNOT Axel"}]
[null,{"$f":"IF(Q4=\"\",L7,IF(L8=\"\",\"\",IF(L8>2,L7,IF(R8>2,Q7,\"\"))))","v":""},null,null,17,18,{"$f":"IF(L14=\"\",Q17,IF(L18=\"\",\"\",IF(L18>2,L17,IF(R18>2,Q17,\"\"))))","v":""},null,null,null,null,{"$f":"IF(Q25=\"\",L28,IF(L29=\"\",\"\",IF(L29>2,L28,IF(R29>2,Q28,\"\"))))","v":""},null,null,17,18,{"$f":"IF(L36=\"\",Q39,IF(L40=\"\",\"\",IF(L40>2,L39,IF(R40>2,Q39,\"\"))))","v":"MILLEMONT Colline"}]
[{"$f":"IF(D60=\"\",\"\",IF(D60>1,1,0))","v":""},{"$f":"IF(D60=\"\",\"\",SUM(A60:A64))","v":""},null,null,null,null,null,{"$f":"IF(G60=\"\",\"\",SUM(J60:J64))","v":""},null,{"$f":"IF(G60=\"\",\"\",IF(G60>1,1,0))","v":""},{"$f":"IF(N60=\"\",\"\",IF(N60>1,1,0))","v":0},{"$f":"IF(N60=\"\",\"\",SUM(K60:K64))","v":0},null,0,null,null,null,{"$f":"IF(Q60=\"\",\"\",SUM(T60:T64))","v":""},null,{"$f":"IF(Q60=\"\",\"\",IF(Q60>1,1,0))","v":""}]
[{"$f":"IF(D61=\"\",\"\",IF(D61>1,1,0))","v":""},null,null,null,null,null,null,null,null,{"$f":"IF(G61=\"\",\"\",IF(G61>1,1,0))","v":""},{"$f":"IF(N61=\"\",\"\",IF(N61>1,1,0))","v":0},null,null,0,null,null,null,null,null,{"$f":"IF(Q61=\"\",\"\",IF(Q61>1,1,0))","v":""}]
[{"$f":"IF(D62=\"\",\"\",IF(D62>1,1,0))","v":""},null,null,null,null,null,null,null,null,{"$f":"IF(G62=\"\",\"\",IF(G62>1,1,0))","v":""},{"$f":"IF(N62=\"\",\"\",IF(N62>1,1,0))","v":0},null,null,0,null,null,null,null,null,{"$f":"IF(Q62=\"\",\"\",IF(Q62>1,1,0))","v":""}]
[{"$f":"IF(D63=\"\",\"\",IF(D63>1,1,0))","v":""},null,null,null,null,null,null,null,null,{"$f":"IF(G63=\"\",\"\",IF(G63>1,1,0))","v":""},{"$f":"IF(N63=\"\",\"\",IF(N63>1,1,0))","v":""},null,null,null,null,null,null,null,null,{"$f":"IF(Q63=\"\",\"\",IF(Q63>1,1,0))","v":""}]
[{"$f":"IF(D64=\"\",\"\",IF(D64>1,1,0))","v":""},null,null,null,null,null,null,null,null,{"$f":"IF(G64=\"\",\"\",IF(G64>1,1,0))","v":""},{"$f":"IF(N64=\"\",\"\",IF(N64>1,1,0))","v":""},null,null,null,null,null,null,null,null,{"$f":"IF(Q64=\"\",\"\",IF(Q64>1,1,0))","v":""}]
[]
["DEMI-FINALES"]
[null,{"$f":"IF(G46=\"\",B46,IF(B50=\"\",\"\",IF(H50=\"\",\"\",IF(B50>2,B46,IF(H50>2,G46,\"\")))))","v":"ROYAN   Les Mouettes"},null,null,"POSTE",null,{"$f":"IF(B56=\"\",G56,IF(B60=\"\",\"\",IF(H60=\"\",\"\",IF(B60>2,B56,IF(H60>2,G56,\"\")))))","v":""},null,null,null,null,{"$f":"IF(Q46=\"\",L46,IF(L50=\"\",\"\",IF(R50=\"\",\"\",IF(L50>2,L46,IF(R50>2,Q46,\"\")))))","v":""},null,null,"POSTE",null,{"$f":"IF(L56=\"\",Q56,IF(L60=\"\",\"\",IF(R60=\"\",\"\",IF(L60>2,L56,IF(R60>2,Q56,\"\")))))","v":"JONZAC   S.J.T"}]
[null,{"$f":"IF(G46=\"\",B47,IF(B50=\"\",\"\",IF(H50=\"\",\"\",IF(B50>2,B47,IF(H50>2,G47,\"\")))))","v":"CHAUVET Tiago"},null,null,6,7,{"$f":"IF(B56=\"\",G57,IF(B60=\"\",\"\",IF(H60=\"\",\"\",IF(B60>2,B57,IF(H60>2,G57,\"\")))))","v":""},null,null,null,null,{"$f":"IF(Q46=\"\",L47,IF(L50=\"\",\"\",IF(R50=\"\",\"\",IF(L50>2,L47,IF(R50>2,Q47,\"\")))))","v":""},null,null,14,15,{"$f":"IF(L56=\"\",Q57,IF(L60=\"\",\"\",IF(R60=\"\",\"\",IF(L60>2,L57,IF(R60>2,Q57,\"\")))))","v":"CRUCHET Luna"}]
[null,{"$f":"IF(G46=\"\",B48,IF(B50=\"\",\"\",IF(H50=\"\",\"\",IF(B50>2,B48,IF(H50>2,G48,\"\")))))","v":"CHOTARD Hugo"},null,null,8,9,{"$f":"IF(B56=\"\",G58,IF(B60=\"\",\"\",IF(H60=\"\",\"\",IF(B60>2,B58,IF(H60>2,G58,\"\")))))","v":""},null,null,null,null,{"$f":"IF(Q46=\"\",L48,IF(L50=\"\",\"\",IF(R50=\"\",\"\",IF(L50>2,L48,IF(R50>2,Q48,\"\")))))","v":""},null,null,16,17,{"$f":"IF(L56=\"\",Q58,IF(L60=\"\",\"\",IF(R60=\"\",\"\",IF(L60>2,L58,IF(R60>2,Q58,\"\")))))","v":"MIGNOT Axel"}]
[null,{"$f":"IF(G46=\"\",B49,IF(B50=\"\",\"\",IF(H50=\"\",\"\",IF(B50>2,B49,IF(H50>2,G49,\"\")))))","v":"LEYRAT Quentin"},null,null,10,11,{"$f":"IF(B56=\"\",G59,IF(B60=\"\",\"\",IF(H60=\"\",\"\",IF(B60>2,B59,IF(H60>2,G59,\"\")))))","v":""},null,null,null,null,{"$f":"IF(Q46=\"\",L49,IF(L50=\"\",\"\",IF(R50=\"\",\"\",IF(L50>2,L49,IF(R50>2,Q49,\"\")))))","v":""},null,null,18,19,{"$f":"IF(L56=\"\",Q59,IF(L60=\"\",\"\",IF(R60=\"\",\"\",IF(L60>2,L59,IF(R60>2,Q59,\"\")))))","v":"MILLEMONT Colline"}]
[{"$f":"IF(D71=\"\",\"\",IF(D71>1,1,0))","v":""},{"$f":"IF(D71=\"\",\"\",SUM(A71:A77))","v":""},null,null,null,null,null,{"$f":"IF(G71=\"\",\"\",SUM(J71:J77))","v":""},null,{"$f":"IF(G71=\"\",\"\",IF(G71>1,1,0))","v":""},{"$f":"IF(N71=\"\",\"\",IF(N71>1,1,0))","v":""},{"$f":"IF(N71=\"\",\"\",SUM(K71:K77))","v":""},null,null,null,null,null,{"$f":"IF(Q71=\"\",\"\",SUM(T71:T77))","v":""},null,{"$f":"IF(Q71=\"\",\"\",IF(Q71>1,1,0))","v":""}]
[{"$f":"IF(D72=\"\",\"\",IF(D72>1,1,0))","v":""},null,null,null,null,null,null,null,null,{"$f":"IF(G72=\"\",\"\",IF(G72>1,1,0))","v":""},{"$f":"IF(N72=\"\",\"\",IF(N72>1,1,0))","v":""},null,null,null,null,null,null,null,null,{"$f":"IF(Q72=\"\",\"\",IF(Q72>1,1,0))","v":""}]
["",null,null,null,null,null,null,null,null,"","",null,null,null,null,null,null,null,null,""]
["",null,null,null,null,null,null,null,null,"","",null,null,null,null,null,null,null,null,""]
["",null,null,null,null,null,null,null,null,"","",null,null,null,null,null,null,null,null,""]
["",null,null,null,null,null,null,null,null,"","",null,null,null,null,null,null,null,null,""]
["",null,null,null,null,null,null,null,null,"","",null,null,null,null,null,null,null,null,""]
[]
[null,null,null,null,null,null,"PETITE FINALE"]
[null,null,null,null,null,null,{"$f":"IF(G67=\"\",\"\",IF(B71=\"\",\"\",IF(H71=\"\",\"\",IF(B71>3,G67,IF(H71>3,B67,\"\")))))","v":""},null,null,"POSTE",null,{"$f":"IF(L67=\"\",\"\",IF(L71=\"\",\"\",IF(R71=\"\",\"\",IF(L71>3,Q67,IF(R71>3,L67,\"\")))))","v":""}]
[null,null,null,null,null,null,{"$f":"IF(G67=\"\",\"\",IF(B71=\"\",\"\",IF(H71=\"\",\"\",IF(B71>3,G68,IF(H71>3,B68,\"\")))))","v":""},null,null,6,7,{"$f":"IF(L67=\"\",\"\",IF(L71=\"\",\"\",IF(R71=\"\",\"\",IF(L71>3,Q68,IF(R71>3,L68,\"\")))))","v":""}]
[null,null,null,null,null,null,{"$f":"IF(G67=\"\",\"\",IF(B71=\"\",\"\",IF(H71=\"\",\"\",IF(B71>3,G69,IF(H71>3,B69,\"\")))))","v":""},null,null,8,9,{"$f":"IF(L67=\"\",\"\",IF(L71=\"\",\"\",IF(R71=\"\",\"\",IF(L71>3,Q69,IF(R71>3,L69,\"\")))))","v":""}]
[null,null,null,null,null,null,{"$f":"IF(G67=\"\",\"\",IF(B71=\"\",\"\",IF(H71=\"\",\"\",IF(B71>3,G70,IF(H71>3,B70,\"\")))))","v":""},null,null,10,11,{"$f":"IF(L67=\"\",\"\",IF(L71=\"\",\"\",IF(R71=\"\",\"\",IF(L71>3,Q70,IF(R71>3,L70,\"\")))))","v":""}]
[null,null,null,null,null,{"$f":"IF(I84=\"\",\"\",IF(I84>1,1,0))","v":""},{"$f":"IF(I84=\"\",\"\",SUM(F84:F90))","v":""},null,null,null,null,null,{"$f":"IF(L84=\"\",\"\",SUM(O84:O90))","v":""},null,{"$f":"IF(L84=\"\",\"\",IF(L84>1,1,0))","v":""}]
[null,null,null,null,null,{"$f":"IF(I85=\"\",\"\",IF(I85>1,1,0))","v":""},null,null,null,null,null,null,null,null,{"$f":"IF(L85=\"\",\"\",IF(L85>1,1,0))","v":""}]
[null,null,null,null,null,"",null,null,null,null,null,null,null,null,""]
[null,null,null,null,null,"",null,null,null,null,null,null,null,null,""]
[null,null,null,null,null,"",null,null,null,null,null,null,null,null,""]
[null,null,null,null,null,"",null,null,null,null,null,null,null,null,""]
[null,null,null,null,null,"",null,null,null,null,null,null,null,null,""]
[]
[null,null,null,null,null,null,"FINALE"]
[]
[null,null,null,null,null,null,{"$f":"IF(G67=\"\",B67,IF(B71=\"\",\"\",IF(H71=\"\",\"\",IF(B71>3,B67,IF(H71>3,G67,\"\")))))","v":"ROYAN   Les Mouettes"},null,null,"POSTE",null,{"$f":"IF(L67=\"\",Q67,IF(L71=\"\",\"\",IF(R71=\"\",\"\",IF(L71>3,L67,IF(R71>3,Q67,\"\")))))","v":"JONZAC   S.J.T"}]
[null,null,null,null,null,null,{"$f":"IF(G67=\"\",B68,IF(B71=\"\",\"\",IF(H71=\"\",\"\",IF(B71>3,B68,IF(H71>3,G68,\"\")))))","v":"CHAUVET Tiago"},null,null,13,14,{"$f":"IF(L67=\"\",Q68,IF(L71=\"\",\"\",IF(R71=\"\",\"\",IF(L71>3,L68,IF(R71>3,Q68,\"\")))))","v":"CRUCHET Luna"}]
[null,null,null,null,null,null,{"$f":"IF(G67=\"\",B69,IF(B71=\"\",\"\",IF(H71=\"\",\"\",IF(B71>3,B69,IF(H71>3,G69,\"\")))))","v":"CHOTARD Hugo"},null,null,15,16,{"$f":"IF(L67=\"\",Q69,IF(L71=\"\",\"\",IF(R71=\"\",\"\",IF(L71>3,L69,IF(R71>3,Q69,\"\")))))","v":"MIGNOT Axel"}]
[null,null,null,null,null,null,{"$f":"IF(G67=\"\",B70,IF(B71=\"\",\"\",IF(H71=\"\",\"\",IF(B71>3,B70,IF(H71>3,G70,\"\")))))","v":"LEYRAT Quentin"},null,null,17,18,{"$f":"IF(L67=\"\",Q70,IF(L71=\"\",\"\",IF(R71=\"\",\"\",IF(L71>3,L70,IF(R71>3,Q70,\"\")))))","v":"MILLEMONT Colline"}]
[null,null,null,null,null,{"$f":"IF(I98=\"\",\"\",IF(I98>1,1,0))","v":0},{"$f":"IF(I98=\"\",\"\",SUM(F98:F104))","v":4},null,1,null,null,2,{"$f":"IF(L98=\"\",\"\",SUM(O98:O104))","v":3},null,{"$f":"IF(L98=\"\",\"\",IF(L98>1,1,0))","v":1}]
[null,null,null,null,null,{"$f":"IF(I99=\"\",\"\",IF(I99>1,1,0))","v":1},null,null,2,null,null,1,null,null,{"$f":"IF(L99=\"\",\"\",IF(L99>1,1,0))","v":0}]
[null,null,null,null,null,1,null,null,2,null,null,1,null,null,0]
[null,null,null,null,null,1,null,null,2,null,null,1,null,null,0]
[null,null,null,null,null,0,null,null,1,null,null,2,null,null,1]
[null,null,null,null,null,1,null,null,3,null,null,2,null,null,1]
[null,null,null,null,null,"",null,null,null,null,null,null,null,null,""]

{"sheet":"PALMARES","index":5,"n_rows":46,"n_cols":13,"rows_kept":46,"cut":false,"hidden":false,"merged":[[22,9,22,12],[0,0,2,7],[3,0,3,7],[10,6,13,6],[6,6,7,6],[8,6,9,6],[14,6,21,6],[9,9,9,12]]}
[{"$f":"CONCATENATE(\"PALMARES \",INFO!C6,\"\n\",\"CHAMPIONNAT DE FRANCE DES CLUBS\nECOLE DE TIR\")","v":"PALMARES \nCHAMPIONNAT DE FRANCE DES CLUBS\nECOLE DE TIR"}]
[]
[]
[{"$f":"CONCATENATE(INFO!B7,\" - \",INFO!B9)","v":"CARABINE - POITOU-CHARENTES"}]
[]
["PLACE","CLUBS","LIGUE","n° CLUB","M Q","Bar."]
[1,{"$f":"IF(A7=\"\",\"\",IF(P.F.!G98>3,P.F.!G94,IF(P.F.!M98>3,P.F.!L94,\"\")))","v":"ROYAN   Les Mouettes"},null,{"$f":"IF(A7=\"\",\"\",VLOOKUP(B7,'M Q'!B$5:T$20,2,0))","v":1717153},{"$f":"IF(A7=\"\",\"\",VLOOKUP(B7,'M Q'!B$5:T$20,18,0))","v":441.19999999999993},{"$f":"IF(A7=\"\",\"\",VLOOKUP(B7,'M Q'!B$5:T$20,19,0))","v":0},"FINALE"]
[{"$f":"IF(INFO!B8>1,2,\"\")","v":2},{"$f":"IF(A8=\"\",\"\",IF(P.F.!G98>3,P.F.!L94,IF(P.F.!M98>3,P.F.!G94,\"\")))","v":"JONZAC   S.J.T"},null,{"$f":"IF(A8=\"\",\"\",VLOOKUP(B8,'M Q'!B$5:T$20,2,0))","v":1717165},{"$f":"IF(A8=\"\",\"\",VLOOKUP(B8,'M Q'!B$5:T$20,18,0))","v":423.7},{"$f":"IF(A8=\"\",\"\",VLOOKUP(B8,'M Q'!B$5:T$20,19,0))","v":0}]
[{"$f":"IF(INFO!B8>2,3,\"\")","v":""},{"$f":"IF(A9=\"\",\"\",IF(INFO!B8=3,P.F.!L80,IF(P.F.!G84>3,P.F.!G80,IF(P.F.!M84>3,P.F.!L80,\"\"))))","v":""},null,{"$f":"IF(A9=\"\",\"\",VLOOKUP(B9,'M Q'!B$5:T$20,2,0))","v":""},{"$f":"IF(A9=\"\",\"\",VLOOKUP(B9,'M Q'!B$5:T$20,18,0))","v":""},{"$f":"IF(A9=\"\",\"\",VLOOKUP(B9,'M Q'!B$5:T$20,19,0))","v":""},"PETITE\nFINALE"]
[{"$f":"IF(INFO!B8>3,4,\"\")","v":""},{"$f":"IF(A10=\"\",\"\",IF(P.F.!G84>3,P.F.!L80,IF(P.F.!M84>3,P.F.!G80,\"\")))","v":""},null,{"$f":"IF(A10=\"\",\"\",VLOOKUP(B10,'M Q'!B$5:T$20,2,0))","v":""},{"$f":"IF(A10=\"\",\"\",VLOOKUP(B10,'M Q'!B$5:T$20,18,0))","v":""},{"$f":"IF(A10=\"\",\"\",VLOOKUP(B10,'M Q'!B$5:T$20,19,0))","v":""},null,null,null,"1/4 finalistes sortants"]
[{"$f":"IF(INFO!B8>4,5,\"\")","v":""},{"$f":"IF(A11=\"\",\"\",VLOOKUP(E11,J$11:M$14,3,0))","v":""},null,{"$f":"IF(A11=\"\",\"\",VLOOKUP(E11,J$11:M$14,4,0))","v":""},{"$f":"IF(A11=\"\",\"\",LARGE(J$11:J$14,1))","v":""},{"$f":"IF(A11=\"\",\"\",VLOOKUP(E11,J$11:M$14,2,0))","v":""},"1 / 4   FINALES",null,null,{"$f":"IF(L11=0,0,VLOOKUP(L11,saisie!C$5:W$44,21,0))","v":0},{"$f":"VLOOKUP(L11,saisie!C$5:W$44,19,0)","v":{"$error":"#N/A"}},{"$f":"IF(P.F.!D50=\"\",0,IF(P.F.!B50>2,P.F.!G46,IF(P.F.!H50>2,P.F.!B46,\"\")))","v":0},{"$f":"VLOOKUP(L11,saisie!C$5:W$44,2,0)","v":{"$error":"#N/A"}}]
[{"$f":"IF(INFO!B8>5,6,\"\")","v":""},{"$f":"IF(A12=\"\",\"\",VLOOKUP(E12,J$11:M$14,3,0))","v":""},null,{"$f":"IF(A12=\"\",\"\",VLOOKUP(E12,J$11:M$14,4,0))","v":""},{"$f":"IF(A12=\"\",\"\",LARGE(J$11:J$14,2))","v":""},{"$f":"IF(A12=\"\",\"\",VLOOKUP(E12,J$11:M$14,2,0))","v":""},null,null,null,{"$f":"IF(L12=0,0,VLOOKUP(L12,saisie!C$5:W$44,21,0))","v":0},{"$f":"VLOOKUP(L12,saisie!C$5:W$44,19,0)","v":{"$error":"#N/A"}},{"$f":"IF(P.F.!Q50=\"\",0,IF(P.F.!L50>2,P.F.!Q46,IF(P.F.!R50>2,P.F.!L46,\"\")))","v":0},{"$f":"VLOOKUP(L12,saisie!C$5:W$44,2,0)","v":{"$error":"#N/A"}}]
[{"$f":"IF(INFO!B8>6,7,\"\")","v":""},{"$f":"IF(A13=\"\",\"\",VLOOKUP(E13,J$11:M$14,3,0))","v":""},null,{"$f":"IF(A13=\"\",\"\",VLOOKUP(E13,J$11:M$14,4,0))","v":""},{"$f":"IF(A13=\"\",\"\",LARGE(J$11:J$14,3))","v":""},{"$f":"IF(A13=\"\",\"\",VLOOKUP(E13,J$11:M$14,2,0))","v":""},null,null,null,{"$f":"VLOOKUP(L13,saisie!C$5:W$44,21,0)","v":{"$error":"#N/A"}},{"$f":"VLOOKUP(L13,saisie!C$5:W$44,19,0)","v":{"$error":"#N/A"}},{"$f":"IF(P.F.!D60=\"\",0,IF(P.F.!H60>2,P.F.!B56,IF(P.F.!B60>2,P.F.!G56,\"\")))","v":0},{"$f":"VLOOKUP(L13,saisie!C$5:W$44,2,0)","v":{"$error":"#N/A"}}]
[{"$f":"IF(INFO!B8>7,8,\"\")","v":""},{"$f":"IF(A14=\"\",\"\",VLOOKUP(E14,J$11:M$14,3,0))","v":""},null,{"$f":"IF(A14=\"\",\"\",VLOOKUP(E14,J$11:M$14,4,0))","v":""},{"$f":"IF(A14=\"\",\"\",LARGE(J$11:J$14,4))","v":""},{"$f":"IF(A14=\"\",\"\",VLOOKUP(E14,J$11:M$14,2,0))","v":""},null,null,null,{"$f":"IF(L14=0,0,VLOOKUP(L14,saisie!C$5:W$44,21,0))","v":0},{"$f":"VLOOKUP(L14,saisie!C$5:W$44,19,0)","v":{"$error":"#N/A"}},{"$f":"IF(P.F.!Q60=\"\",0,IF(P.F.!R60>2,P.F.!L56,IF(P.F.!L60>2,P.F.!Q56,\"\")))","v":0},{"$f":"VLOOKUP(L14,saisie!C$5:W$44,2,0)","v":{"$error":"#N/A"}}]
[{"$f":"IF(INFO!B8>8,9,\"\")","v":""},{"$f":"IF(A15=\"\",\"\",VLOOKUP(E15,J$15:M$22,3,0))","v":""},null,{"$f":"IF(A15=\"\",\"\",VLOOKUP(E15,J$15:M$22,4,0))","v":""},{"$f":"IF(A15=\"\",\"\",LARGE(J$15:J$22,1))","v":""},{"$f":"IF(A15=\"\",\"\",VLOOKUP(E15,J$15:M$22,2,0))","v":""},"1 / 8   FINALES",null,null,{"$f":"IF(L15=\"\",0,VLOOKUP(L15,saisie!C$5:W$44,21,0))","v":0},{"$f":"VLOOKUP(L15,saisie!C$5:W$44,19,0)","v":{"$error":"#N/A"}},{"$f":"IF(P.F.!D8=\"\",\"\",IF(P.F.!B8>2,P.F.!G4,IF(P.F.!H8>2,P.F.!B4,\"\")))","v":""},{"$f":"VLOOKUP(L15,saisie!C$5:W$44,2,0)","v":{"$error":"#N/A"}}]
[{"$f":"IF(INFO!B8>9,10,\"\")","v":""},{"$f":"IF(A16=\"\",\"\",VLOOKUP(E16,J$15:M$22,3,0))","v":""},null,{"$f":"IF(A16=\"\",\"\",VLOOKUP(E16,J$15:M$22,4,0))","v":""},{"$f":"IF(A16=\"\",\"\",LARGE(J$15:J$22,2))","v":""},{"$f":"IF(A16=\"\",\"\",VLOOKUP(E16,J$15:M$22,2,0))","v":""},null,null,null,{"$f":"IF(L16=\"\",0,VLOOKUP(L16,saisie!C$5:W$44,21,0))","v":0},{"$f":"VLOOKUP(L16,saisie!C$5:W$44,19,0)","v":{"$error":"#N/A"}},{"$f":"IF(P.F.!N8=\"\",\"\",IF(P.F.!L8>2,P.F.!Q4,IF(P.F.!R8>2,P.F.!L4,\"\")))","v":""},{"$f":"VLOOKUP(L16,saisie!C$5:W$44,2,0)","v":{"$error":"#N/A"}}]
[{"$f":"IF(INFO!B8>10,11,\"\")","v":""},"",null,"",{"$f":"IF(A17=\"\",\"\",LARGE(J$15:J$22,3))","v":""},"",null,null,null,{"$f":"IF(L17=\"\",0,VLOOKUP(L17,saisie!C$5:W$44,21,0))","v":0},{"$f":"VLOOKUP(L17,saisie!C$5:W$44,19,0)","v":{"$error":"#N/A"}},{"$f":"IF(P.F.!G18=\"\",\"\",IF(P.F.!H18>2,P.F.!B14,IF(P.F.!B18>2,P.F.!G14,\"\")))","v":""},{"$f":"VLOOKUP(L17,saisie!C$5:W$44,2,0)","v":{"$error":"#N/A"}}]
[{"$f":"IF(INFO!B8>11,12,\"\")","v":""},"",null,"",{"$f":"IF(A18=\"\",\"\",LARGE(J$15:J$22,4))","v":""},"",null,null,null,{"$f":"IF(L18=\"\",0,VLOOKUP(L18,saisie!C$5:W$44,21,0))","v":0},{"$f":"VLOOKUP(L18,saisie!C$5:W$44,19,0)","v":{"$error":"#N/A"}},{"$f":"IF(P.F.!Q18=\"\",\"\",IF(P.F.!R18>2,P.F.!L14,IF(P.F.!L18>2,P.F.!Q14,\"\")))","v":""},{"$f":"VLOOKUP(L18,saisie!C$5:W$44,2,0)","v":{"$error":"#N/A"}}]
[{"$f":"IF(INFO!B8>12,13,\"\")","v":""},"",null,"",{"$f":"IF(A19=\"\",\"\",LARGE(J$15:J$22,5))","v":""},"",null,null,null,{"$f":"IF(L19=\"\",0,VLOOKUP(L19,saisie!C$5:W$44,21,0))","v":0},{"$f":"VLOOKUP(L19,saisie!C$5:W$44,19,0)","v":{"$error":"#N/A"}},{"$f":"IF(P.F.!D29=\"\",\"\",IF(P.F.!B29>2,P.F.!G25,IF(P.F.!H29>2,P.F.!B25,\"\")))","v":""},{"$f":"VLOOKUP(L19,saisie!C$5:W$44,2,0)","v":{"$error":"#N/A"}}]
[{"$f":"IF(INFO!B8>13,14,\"\")","v":""},"",null,"",{"$f":"IF(A20=\"\",\"\",LARGE(J$15:J$22,6))","v":""},"",null,null,null,{"$f":"IF(L20=\"\",0,VLOOKUP(L20,saisie!C$5:W$44,21,0))","v":0},{"$f":"VLOOKUP(L20,saisie!C$5:W$44,19,0)","v":{"$error":"#N/A"}},{"$f":"IF(P.F.!N29=\"\",\"\",IF(P.F.!L29>2,P.F.!Q25,IF(P.F.!R29>2,P.F.!L25,\"\")))","v":""},{"$f":"VLOOKUP(L20,saisie!C$5:W$44,2,0)","v":{"$error":"#N/A"}}]
[{"$f":"IF(INFO!B8>14,15,\"\")","v":""},"",null,"",{"$f":"IF(A21=\"\",\"\",LARGE(J$15:J$22,7))","v":""},"",null,null,null,{"$f":"IF(L21=\"\",0,VLOOKUP(L21,saisie!C$5:W$44,21,0))","v":0},{"$f":"VLOOKUP(L21,saisie!C$5:W$44,19,0)","v":{"$error":"#N/A"}},{"$f":"IF(P.F.!G40=\"\",\"\",IF(P.F.!H40>2,P.F.!B36,IF(P.F.!B40>2,P.F.!G36,\"\")))","v":""},{"$f":"VLOOKUP(L21,saisie!C$5:W$44,2,0)","v":{"$error":"#N/A"}}]
[{"$f":"IF(INFO!B8>15,16,\"\")","v":""},"",null,"",{"$f":"IF(A22=\"\",\"\",LARGE(J$15:J$22,8))","v":""},"",null,null,null,{"$f":"IF(L22=\"\",0,VLOOKUP(L22,saisie!C$5:W$44,21,0))","v":0},{"$f":"VLOOKUP(L22,saisie!C$5:W$44,19,0)","v":{"$error":"#N/A"}},{"$f":"IF(P.F.!Q40=\"\",\"\",IF(P.F.!R40>2,P.F.!L36,IF(P.F.!L40>2,P.F.!Q36,\"\")))","v":""},{"$f":"VLOOKUP(L22,saisie!C$5:W$44,2,0)","v":{"$error":"#N/A"}}]
[{"$f":"IF(INFO!B8>16,17,\"\")","v":""},{"$f":"IF(A23=\"\",\"\",'M Q'!B21)","v":""},null,{"$f":"IF(A23=\"\",\"\",'M Q'!C21)","v":""},{"$f":"IF(A23=\"\",\"\",'M Q'!S21)","v":""},{"$f":"IF(A23=\"\",\"\",'M Q'!T21)","v":""},null,null,null,"1/8 finalistes sortants"]
[{"$f":"IF(INFO!B8>17,18,\"\")","v":""},{"$f":"IF(A24=\"\",\"\",'M Q'!B22)","v":""},null,{"$f":"IF(A24=\"\",\"\",'M Q'!C22)","v":""},{"$f":"IF(A24=\"\",\"\",'M Q'!S22)","v":""},{"$f":"IF(A24=\"\",\"\",'M Q'!T22)","v":""}]
[{"$f":"IF(INFO!B8>18,19,\"\")","v":""},{"$f":"IF(A25=\"\",\"\",'M Q'!B23)","v":""},null,{"$f":"IF(A25=\"\",\"\",'M Q'!C23)","v":""},{"$f":"IF(A25=\"\",\"\",'M Q'!S23)","v":""},{"$f":"IF(A25=\"\",\"\",'M Q'!T23)","v":""}]
[{"$f":"IF(INFO!B8>19,20,\"\")","v":""},{"$f":"IF(A26=\"\",\"\",'M Q'!B24)","v":""},null,{"$f":"IF(A26=\"\",\"\",'M Q'!C24)","v":""},{"$f":"IF(A26=\"\",\"\",'M Q'!S24)","v":""},{"$f":"IF(A26=\"\",\"\",'M Q'!T24)","v":""}]
[{"$f":"IF(INFO!B8>20,21,\"\")","v":""},{"$f":"IF(A27=\"\",\"\",'M Q'!B25)","v":""},null,{"$f":"IF(A27=\"\",\"\",'M Q'!C25)","v":""},{"$f":"IF(A27=\"\",\"\",'M Q'!S25)","v":""},{"$f":"IF(A27=\"\",\"\",'M Q'!T25)","v":""}]
[{"$f":"IF(INFO!B8>21,22,\"\")","v":""},{"$f":"IF(A28=\"\",\"\",'M Q'!B26)","v":""},null,{"$f":"IF(A28=\"\",\"\",'M Q'!C26)","v":""},{"$f":"IF(A28=\"\",\"\",'M Q'!S26)","v":""},{"$f":"IF(A28=\"\",\"\",'M Q'!T26)","v":""}]
[{"$f":"IF(INFO!B8>22,23,\"\")","v":""},{"$f":"IF(A29=\"\",\"\",'M Q'!B27)","v":""},null,{"$f":"IF(A29=\"\",\"\",'M Q'!C27)","v":""},{"$f":"IF(A29=\"\",\"\",'M Q'!S27)","v":""},{"$f":"IF(A29=\"\",\"\",'M Q'!T27)","v":""}]
[{"$f":"IF(INFO!B8>23,24,\"\")","v":""},{"$f":"IF(A30=\"\",\"\",'M Q'!B28)","v":""},null,{"$f":"IF(A30=\"\",\"\",'M Q'!C28)","v":""},{"$f":"IF(A30=\"\",\"\",'M Q'!S28)","v":""},{"$f":"IF(A30=\"\",\"\",'M Q'!T28)","v":""}]
[{"$f":"IF(INFO!B8>24,25,\"\")","v":""},{"$f":"IF(A31=\"\",\"\",'M Q'!B29)","v":""},null,{"$f":"IF(A31=\"\",\"\",'M Q'!C29)","v":""},{"$f":"IF(A31=\"\",\"\",'M Q'!S29)","v":""},{"$f":"IF(A31=\"\",\"\",'M Q'!T29)","v":""}]
[{"$f":"IF(INFO!B8>25,26,\"\")","v":""},{"$f":"IF(A32=\"\",\"\",'M Q'!B30)","v":""},null,{"$f":"IF(A32=\"\",\"\",'M Q'!C30)","v":""},{"$f":"IF(A32=\"\",\"\",'M Q'!S30)","v":""},{"$f":"IF(A32=\"\",\"\",'M Q'!T30)","v":""}]
[{"$f":"IF(INFO!B8>26,27,\"\")","v":""},{"$f":"IF(A33=\"\",\"\",'M Q'!B31)","v":""},null,{"$f":"IF(A33=\"\",\"\",'M Q'!C31)","v":""},{"$f":"IF(A33=\"\",\"\",'M Q'!S31)","v":""},{"$f":"IF(A33=\"\",\"\",'M Q'!T31)","v":""}]
[{"$f":"IF(INFO!B8>27,28,\"\")","v":""},{"$f":"IF(A34=\"\",\"\",'M Q'!B32)","v":""},null,{"$f":"IF(A34=\"\",\"\",'M Q'!C32)","v":""},{"$f":"IF(A34=\"\",\"\",'M Q'!S32)","v":""},{"$f":"IF(A34=\"\",\"\",'M Q'!T32)","v":""}]
[{"$f":"IF(INFO!B8>28,29,\"\")","v":""},{"$f":"IF(A35=\"\",\"\",'M Q'!B33)","v":""},null,{"$f":"IF(A35=\"\",\"\",'M Q'!C33)","v":""},{"$f":"IF(A35=\"\",\"\",'M Q'!S33)","v":""},{"$f":"IF(A35=\"\",\"\",'M Q'!T33)","v":""}]
[{"$f":"IF(INFO!B8>29,30,\"\")","v":""},{"$f":"IF(A36=\"\",\"\",'M Q'!B34)","v":""},null,{"$f":"IF(A36=\"\",\"\",'M Q'!C34)","v":""},{"$f":"IF(A36=\"\",\"\",'M Q'!S34)","v":""},{"$f":"IF(A36=\"\",\"\",'M Q'!T34)","v":""}]
[{"$f":"IF(INFO!B8>30,31,\"\")","v":""},{"$f":"IF(A37=\"\",\"\",'M Q'!B35)","v":""},null,{"$f":"IF(A37=\"\",\"\",'M Q'!C35)","v":""},{"$f":"IF(A37=\"\",\"\",'M Q'!S35)","v":""},{"$f":"IF(A37=\"\",\"\",'M Q'!T35)","v":""}]
[{"$f":"IF(INFO!B8>31,32,\"\")","v":""},{"$f":"IF(A38=\"\",\"\",'M Q'!B36)","v":""},null,{"$f":"IF(A38=\"\",\"\",'M Q'!C36)","v":""},{"$f":"IF(A38=\"\",\"\",'M Q'!S36)","v":""},{"$f":"IF(A38=\"\",\"\",'M Q'!T36)","v":""}]
[{"$f":"IF(INFO!B8>32,33,\"\")","v":""},{"$f":"IF(A39=\"\",\"\",'M Q'!B37)","v":""},null,{"$f":"IF(A39=\"\",\"\",'M Q'!C37)","v":""},{"$f":"IF(A39=\"\",\"\",'M Q'!S37)","v":""},{"$f":"IF(A39=\"\",\"\",'M Q'!T37)","v":""}]
[{"$f":"IF(INFO!B8>33,34,\"\")","v":""},{"$f":"IF(A40=\"\",\"\",'M Q'!B38)","v":""},null,{"$f":"IF(A40=\"\",\"\",'M Q'!C38)","v":""},{"$f":"IF(A40=\"\",\"\",'M Q'!S38)","v":""},{"$f":"IF(A40=\"\",\"\",'M Q'!T38)","v":""}]
[{"$f":"IF(INFO!B8>34,35,\"\")","v":""},{"$f":"IF(A41=\"\",\"\",'M Q'!B39)","v":""},null,{"$f":"IF(A41=\"\",\"\",'M Q'!C39)","v":""},{"$f":"IF(A41=\"\",\"\",'M Q'!S39)","v":""},{"$f":"IF(A41=\"\",\"\",'M Q'!T39)","v":""}]
[{"$f":"IF(INFO!B8>35,36,\"\")","v":""},{"$f":"IF(A42=\"\",\"\",'M Q'!B40)","v":""},null,{"$f":"IF(A42=\"\",\"\",'M Q'!C40)","v":""},{"$f":"IF(A42=\"\",\"\",'M Q'!S40)","v":""},{"$f":"IF(A42=\"\",\"\",'M Q'!T40)","v":""}]
[{"$f":"IF(INFO!B8>36,37,\"\")","v":""},{"$f":"IF(A43=\"\",\"\",'M Q'!B41)","v":""},null,{"$f":"IF(A43=\"\",\"\",'M Q'!C41)","v":""},{"$f":"IF(A43=\"\",\"\",'M Q'!S41)","v":""},{"$f":"IF(A43=\"\",\"\",'M Q'!T41)","v":""}]
[{"$f":"IF(INFO!B8>37,38,\"\")","v":""},{"$f":"IF(A44=\"\",\"\",'M Q'!B42)","v":""},null,{"$f":"IF(A44=\"\",\"\",'M Q'!C42)","v":""},{"$f":"IF(A44=\"\",\"\",'M Q'!S42)","v":""},{"$f":"IF(A44=\"\",\"\",'M Q'!T42)","v":""}]
[{"$f":"IF(INFO!B8>38,39,\"\")","v":""},{"$f":"IF(A45=\"\",\"\",'M Q'!B43)","v":""},null,{"$f":"IF(A45=\"\",\"\",'M Q'!C43)","v":""},{"$f":"IF(A45=\"\",\"\",'M Q'!S43)","v":""},{"$f":"IF(A45=\"\",\"\",'M Q'!T43)","v":""}]
[{"$f":"IF(INFO!B8>39,40,\"\")","v":""},{"$f":"IF(A46=\"\",\"\",'M Q'!B44)","v":""},null,{"$f":"IF(A46=\"\",\"\",'M Q'!C44)","v":""},{"$f":"IF(A46=\"\",\"\",'M Q'!S44)","v":""},{"$f":"IF(A46=\"\",\"\",'M Q'!T44)","v":""}]